{"text_format":"1","workbook":"xlsx","n_sheets":11,"sheets":["Einstieg","Direktzahlungen","Ökoregelungen","Formeln","Druck","Vorlage Einstieg","Parameter","Konditionalität","Hilfe","Rech_öko","Berechnungen"],"not_rendered":{"charts":4,"images":5,"macros":1,"external_links":0,"defined_names":3,"comments":1,"pivot_tables":0},"unopened":[],"bounds":{"document_bytes":16777216,"sheet_cells":100000,"rows_first":2000,"rows_last":500,"rows_between":2000,"halvings":0,"cell_chars":16384,"cell_head_chars":4096},"cells_cut":0,"cells_raw":0,"read":"whole","date_system":"1900"}

{"sheet":"Einstieg","index":0,"n_rows":0,"n_cols":0,"rows_kept":0,"cut":false,"hidden":false,"merged":[]}

{"sheet":"Direktzahlungen","index":1,"n_rows":94,"n_cols":16,"rows_kept":94,"cut":false,"hidden":false,"merged":[]}
[null,"Aktuell gültige Betriebsdaten für Direktzahlungen ",null,null,null,null,null,null,null,null,"Kosten für Erfüllung der Konditionalitäten","ha","Kosten/ha (€)","Kosten ges. (€)"]
[null,null,"ha",null,null,null,null,null,null,null,"GLÖZ 1    Erhaltung von Dauergrünland",{"$f":"C7","v":0},0,{"$f":"+L2*M2","v":0}]
[null,"Ackerland (AL):",0,null,"Anzahl Mutterkühe:",null,null,0,null,null,"GLÖZ 2    Schutz von Feuchtgebieten und Torfflächen",0,0,0]
[null,"    Ackerland (AL) ohne Fruchtwechsel",0,null,"Anzahl Mutterschafe/-ziegen",null,null,0,null,null,"GLÖZ 3    Verbot des Abbrennens von Stoppelfeldern",0,0,0]
[null,"    Gras- und Grünfutterpfl., Leguminosen (AL)",0,null,null,null,null,null,null,null,"GLÖZ 4    Pufferstreifen entlang von Wasserläufen",0,0,0]
[null,"    Landschaftselemente u. Pufferstreifen auf AL",0,null,"Junglandwirt (Jahr des erstmaligen Antrags)",null,null,0,null,null,"GLÖZ 5    Bodenschädigung und -erosion",{"$f":"C3","v":0},0,0]
[null,"Dauergrünland (DG):",0,null,"Ökolandwirt",null,null,"nein",null,null,"GLÖZ 6    Mindestbodenbedeckung",0,0,0]
[null,"Dauerkulturfläche (DK):",0,null,null,null,null,null,null,null,"GLÖZ 7    Fruchtwechsel auf Ackerland",{"$f":"IF(C9=0,0,IF(OR(H7=\"ja\",C3<=10,AND(C9<=50,(C5+C7+L9+Ökoregelungen!F5)/C9>=0.75)),0,(C4)))","v":0},0,0]
[null,"Förderfähige ldw. Fläche:",{"$f":"C3+C7+C8","v":0},null,null,null,null,null,null,null,"GLÖZ 8    Brache (4% des AL)",{"$f":"IF(C9=0,0,IF(OR(C3<=10,AND(C9<=50,(C5+C7)/C9>=0.75)),0,MAX(0,C3*0.04-C6)))","v":0},0,0]
[null,"LF in Natura-2000-Gebieten:",0,null,null,null,null,null,null,null,"GLÖZ 9    Dauergrünland in Natura-2000-Gebieten",0,0,0]
{"$rows_left_out":85}
{"sheet":"Ökoregelungen","index":2,"n_rows":62,"n_cols":11,"rows_kept":62,"cut":false,"hidden":false,"merged":[[4,1,7,1],[12,1,14,1],[1,7,1,10],[3,7,3,9]]}
[]
[null,"Freiwillige Öko-Regelungen: Zahlungen und Kostenansätze",null,null,null,null,null,"Beträge für das Jahr 2023"]
[null,null,null,null,null,null,null,"Zahlung","Kosten","Überschuss","Überschuss"]
[null,null,null,null,null,null,null,"in €/ha",null,null,"gesamt (€)"]
[null,"(1) Bio- diversität","1a  -  Aufstockung nichtproduktives AL",0,"% AL",{"$f":"D5*Direktzahlungen!C3/100","v":0},"ha",{"$f":"Rech_öko!H6","v":0},0,{"$f":"H5-I5","v":0},{"$f":"(H5-I5)*F5","v":0}]
[null,null,"1b  -  Blühflächen/-streifen auf AL nach 1a",0,"ha",{"$f":"IF(D6<0.1,0,MIN(D6,F5))","v":0},"ha",150,0,{"$f":"H6-I6","v":150},0]
[null,null,"1c  -  Blühflächen/-streifen auf DK-Fläche",0,"ha",{"$f":"MIN(D7,Direktzahlungen!C8)","v":0},"ha",150,0,150,0]
[null,null,"1d  -  Altgrasflächen/-streifen auf DGL",0,"% DGL",{"$f":"IF(D8*Direktzahlungen!C7/100<0.1,0,D8*Direktzahlungen!C7/100)","v":0},"ha",{"$f":"Rech_öko!H12","v":0},0,0,0]
[null,"(2)    Vielfältige Kulturen im Ackerbau ",null,"nein",null,{"$f":"IF(D9=\"nein\",0,Direktzahlungen!C3)","v":0},"ha",45,0,45,0]
[null,"(3)    Agroforstsysteme auf AL und DGL",null,0,"ha",{"$f":"MIN(D10,Direktzahlungen!C3+Direktzahlungen!C7)","v":0},"ha",60,0,60,0]
{"$rows_left_out":53}
{"sheet":"Formeln","index":3,"n_rows":482,"n_cols":17,"rows_kept":482,"cut":false,"hidden":false,"merged":[[20,16,47,21],[51,16,78,21],[82,16,109,21],[113,16,140,21],[144,16,171,21],[361,16,388,21],[392,16,419,21],[423,16,450,21],[454,16,481,21],[175,16,202,21],[206,16,233,21],[237,16,264,21],[268,16,295,21],[299,16,326,21],[330,16,357,21]]}
[null,"Formel-Nr","Fenster (Formel)","Zeile (Beginn Formel)","Spalte (beginn Formel)","IDB","F_FB","Z_FB","S_FB"]
[null,3,4,82,3,1,2,9,13,"Kosten","GLÖZ 8    Brache (4% des AL)"]
[null,1,4,{"$f":"ROW(Formeln!C20)","v":20},{"$f":"COLUMN(Formeln!C20)","v":3},1,3,{"$f":"ROW(Ökoregelungen!I5)","v":5},{"$f":"COLUMN(Ökoregelungen!I5)","v":9},"Kosten",{"$f":"Formeln!M20","v":"1a  -  Aufstockung nichtproduktives AL"}]
[null,2,4,{"$f":"ROW(Formeln!C51)","v":51},{"$f":"COLUMN(Formeln!C51)","v":3},0,2,{"$f":"ROW(Direktzahlungen!L9)","v":9},{"$f":"COLUMN(Direktzahlungen!L9)","v":12},"Fläche",{"$f":"Direktzahlungen!K9","v":"GLÖZ 8    Brache (4% des AL)"}]
[null,3,4,{"$f":"ROW(Formeln!C82)","v":82},{"$f":"COLUMN(Formeln!C82)","v":3},1,2,{"$f":"ROW(Direktzahlungen!M9)","v":9},{"$f":"COLUMN(Direktzahlungen!M9)","v":13},"Kosten",{"$f":"Direktzahlungen!K9","v":"GLÖZ 8    Brache (4% des AL)"}]
[null,4,4,{"$f":"ROW(Formeln!C113)","v":113},{"$f":"COLUMN(Formeln!C113)","v":3},1,3,{"$f":"ROW(Ökoregelungen!I6)","v":6},{"$f":"COLUMN(Ökoregelungen!I6)","v":9},"Kosten",{"$f":"Ökoregelungen!C6","v":"1b  -  Blühflächen/-streifen auf AL nach 1a"}]
[null,5,4,{"$f":"ROW(Formeln!C144)","v":144},{"$f":"COLUMN(Formeln!C144)","v":3},1,2,{"$f":"ROW(Direktzahlungen!L8)","v":8},{"$f":"COLUMN(Direktzahlungen!L8)","v":12},{"$f":"M144","v":"GLÖZ 7    Fruchtwechsel auf Ackerland"}]
[null,6,4,{"$f":"ROW(Formeln!C175)","v":175},{"$f":"COLUMN(Formeln!C175)","v":3},1,2,{"$f":"ROW(Direktzahlungen!M5)","v":5},{"$f":"COLUMN(Direktzahlungen!M5)","v":13},{"$f":"M175","v":"GLÖZ 4    Pufferstreifen entlang von Wasserläufen"}]
[null,7,4,{"$f":"ROW(C206)","v":206},{"$f":"COLUMN(Formeln!C56)","v":3},1,2,{"$f":"ROW($A$1)","v":1},{"$f":"COLUMN($A$1)","v":1}]
[null,{"$f":"B9+1","v":8},4,{"$f":"ROW(C237)","v":237},{"$f":"COLUMN(Formeln!C57)","v":3},1,2,1,1]
{"$rows_left_out":473}
{"sheet":"Druck","index":4,"n_rows":52,"n_cols":19,"rows_kept":52,"cut":false,"hidden":false,"merged":[[26,6,26,7],[26,8,26,9],[19,6,19,7],[20,6,20,7],[38,1,41,1],[23,6,23,7],[24,6,24,7],[19,8,19,9],[20,8,20,9],[21,8,21,9],[22,8,22,9],[23,8,23,9],[37,7,37,9],[27,8,27,9],[28,8,28,9],[29,8,29,9],[46,1,48,1],[14,6,14,7],[15,6,15,7],[16,6,16,7],[17,6,17,7],[18,6,18,7],[35,7,35,10],[25,8,25,9],[27,6,27,7],[28,6,28,7],[29,6,29,7],[30,6,30,7],[25,6,25,7],[24,8,24,9],[21,6,21,7],[22,6,22,7],[30,8,30,9],[14,8,14,9],[15,8,15,9],[16,8,16,9],[17,8,17,9],[18,8,18,9]]}
[]
[{"$f":"IF(Direktzahlungen!A1=\"\",\"\",Direktzahlungen!A1)","v":""},null,{"$f":"IF(Direktzahlungen!B1=\"\",\"\",Direktzahlungen!B1)","v":"Aktuell gültige Betriebsdaten für Direktzahlungen "},{"$f":"IF(Direktzahlungen!C1=\"\",\"\",Direktzahlungen!C1)","v":""},{"$f":"IF(Direktzahlungen!D1=\"\",\"\",Direktzahlungen!D1)","v":""},{"$f":"IF(Direktzahlungen!E1=\"\",\"\",Direktzahlungen!E1)","v":""},{"$f":"IF(Direktzahlungen!F1=\"\",\"\",Direktzahlungen!F1)","v":""},null,{"$f":"IF(Direktzahlungen!G1=\"\",\"\",Direktzahlungen!G1)","v":""},null,{"$f":"IF(Direktzahlungen!H1=\"\",\"\",Direktzahlungen!H1)","v":""},{"$f":"IF(Direktzahlungen!I1=\"\",\"\",Direktzahlungen!I1)","v":""},{"$f":"\"  \"&Direktzahlungen!K1","v":"  Kosten für Erfüllung der Konditionalitäten"},null,null,null,{"$f":"IF(Direktzahlungen!L1=\"\",\"\",Direktzahlungen!L1)","v":"ha"},{"$f":"IF(Direktzahlungen!M1=\"\",\"\",Direktzahlungen!M1)","v":"Kosten/ha (€)"},{"$f":"IF(Direktzahlungen!N1=\"\",\"\",Direktzahlungen!N1)","v":"Kosten ges. (€)"}]
[{"$f":"IF(Direktzahlungen!A2=\"\",\"\",Direktzahlungen!A2)","v":""},null,{"$f":"IF(Direktzahlungen!B2=\"\",\"\",Direktzahlungen!B2)","v":""},{"$f":"IF(Direktzahlungen!C2=\"\",\"\",Direktzahlungen!C2)","v":"ha"},{"$f":"IF(Direktzahlungen!D2=\"\",\"\",Direktzahlungen!D2)","v":""},{"$f":"IF(Direktzahlungen!E2=\"\",\"\",Direktzahlungen!E2)","v":""},{"$f":"IF(Direktzahlungen!F2=\"\",\"\",Direktzahlungen!F2)","v":""},null,{"$f":"IF(Direktzahlungen!G2=\"\",\"\",Direktzahlungen!G2)","v":""},null,{"$f":"IF(Direktzahlungen!H2=\"\",\"\",Direktzahlungen!H2)","v":""},{"$f":"IF(Direktzahlungen!I2=\"\",\"\",Direktzahlungen!I2)","v":""},{"$f":"\"  \"&Direktzahlungen!K2","v":"  GLÖZ 1    Erhaltung von Dauergrünland"},null,null,null,{"$f":"IF(Direktzahlungen!L2=\"\",\"\",Direktzahlungen!L2)","v":0},{"$f":"IF(Direktzahlungen!M2=\"\",\"\",Direktzahlungen!M2)","v":0},{"$f":"IF(Direktzahlungen!N2=\"\",\"\",Direktzahlungen!N2)","v":0}]
[{"$f":"IF(Direktzahlungen!A3=\"\",\"\",Direktzahlungen!A3)","v":""},null,{"$f":"IF(Direktzahlungen!B3=\"\",\"\",Direktzahlungen!B3)","v":"Ackerland (AL):"},{"$f":"IF(Direktzahlungen!C3=\"\",\"\",Direktzahlungen!C3)","v":0},{"$f":"IF(Direktzahlungen!D3=\"\",\"\",Direktzahlungen!D3)","v":""},{"$f":"IF(Direktzahlungen!E3=\"\",\"\",Direktzahlungen!E3)","v":"Anzahl Mutterkühe:"},null,null,null,null,{"$f":"IF(Direktzahlungen!H3=\"\",\"\",Direktzahlungen!H3)","v":0},{"$f":"IF(Direktzahlungen!I3=\"\",\"\",Direktzahlungen!I3)","v":""},{"$f":"\"  \"&Direktzahlungen!K3","v":"  GLÖZ 2    Schutz von Feuchtgebieten und Torfflächen"},null,null,null,{"$f":"IF(Direktzahlungen!L3=\"\",\"\",Direktzahlungen!L3)","v":0},{"$f":"IF(Direktzahlungen!M3=\"\",\"\",Direktzahlungen!M3)","v":0},{"$f":"IF(Direktzahlungen!N3=\"\",\"\",Direktzahlungen!N3)","v":0}]
[{"$f":"IF(Direktzahlungen!A4=\"\",\"\",Direktzahlungen!A4)","v":""},null,{"$f":"IF(Direktzahlungen!B4=\"\",\"\",Direktzahlungen!B4)","v":"    Ackerland (AL) ohne Fruchtwechsel"},{"$f":"IF(Direktzahlungen!C4=\"\",\"\",Direktzahlungen!C4)","v":0},{"$f":"IF(Direktzahlungen!D4=\"\",\"\",Direktzahlungen!D4)","v":""},{"$f":"IF(Direktzahlungen!E4=\"\",\"\",Direktzahlungen!E4)","v":"Anzahl Mutterschafe/-ziegen"},null,null,null,null,{"$f":"IF(Direktzahlungen!H4=\"\",\"\",Direktzahlungen!H4)","v":0},{"$f":"IF(Direktzahlungen!I4=\"\",\"\",Direktzahlungen!I4)","v":""},{"$f":"\"  \"&Direktzahlungen!K4","v":"  GLÖZ 3    Verbot des Abbrennens von Stoppelfeldern"},null,null,null,{"$f":"IF(Direktzahlungen!L4=\"\",\"\",Direktzahlungen!L4)","v":0},{"$f":"IF(Direktzahlungen!M4=\"\",\"\",Direktzahlungen!M4)","v":0},{"$f":"IF(Direktzahlungen!N4=\"\",\"\",Direktzahlungen!N4)","v":0}]
[{"$f":"IF(Direktzahlungen!A5=\"\",\"\",Direktzahlungen!A5)","v":""},null,{"$f":"IF(Direktzahlungen!B5=\"\",\"\",Direktzahlungen!B5)","v":"    Gras- und Grünfutterpfl., Leguminosen (AL)"},{"$f":"IF(Direktzahlungen!C5=\"\",\"\",Direktzahlungen!C5)","v":0},{"$f":"IF(Direktzahlungen!D5=\"\",\"\",Direktzahlungen!D5)","v":""},{"$f":"IF(Direktzahlungen!E5=\"\",\"\",Direktzahlungen!E5)","v":""},null,null,null,null,{"$f":"IF(Direktzahlungen!H5=\"\",\"\",Direktzahlungen!H5)","v":""},{"$f":"IF(Direktzahlungen!I5=\"\",\"\",Direktzahlungen!I5)","v":""},{"$f":"\"  \"&Direktzahlungen!K5","v":"  GLÖZ 4    Pufferstreifen entlang von Wasserläufen"},null,null,null,{"$f":"IF(Direktzahlungen!L5=\"\",\"\",Direktzahlungen!L5)","v":0},{"$f":"IF(Direktzahlungen!M5=\"\",\"\",Direktzahlungen!M5)","v":0},{"$f":"IF(Direktzahlungen!N5=\"\",\"\",Direktzahlungen!N5)","v":0}]
[{"$f":"IF(Direktzahlungen!A7=\"\",\"\",Direktzahlungen!A7)","v":""},null,{"$f":"IF(Direktzahlungen!B6=\"\",\"\",Direktzahlungen!B6)","v":"    Landschaftselemente u. Pufferstreifen auf AL"},{"$f":"IF(Direktzahlungen!C6=\"\",\"\",Direktzahlungen!C6)","v":0},{"$f":"IF(Direktzahlungen!D6=\"\",\"\",Direktzahlungen!D6)","v":""},{"$f":"IF(Direktzahlungen!E6=\"\",\"\",Direktzahlungen!E6)","v":"Junglandwirt (Jahr des erstmaligen Antrags)"},null,null,null,null,{"$f":"IF(Direktzahlungen!H6=\"\",\"\",Direktzahlungen!H6)","v":0},{"$f":"IF(Direktzahlungen!I6=\"\",\"\",Direktzahlungen!I6)","v":""},{"$f":"\"  \"&Direktzahlungen!K6","v":"  GLÖZ 5    Bodenschädigung und -erosion"},null,null,null,{"$f":"IF(Direktzahlungen!L6=\"\",\"\",Direktzahlungen!L6)","v":0},{"$f":"IF(Direktzahlungen!M6=\"\",\"\",Direktzahlungen!M6)","v":0},{"$f":"IF(Direktzahlungen!N6=\"\",\"\",Direktzahlungen!N6)","v":0}]
[{"$f":"IF(Direktzahlungen!A8=\"\",\"\",Direktzahlungen!A8)","v":""},null,{"$f":"IF(Direktzahlungen!B7=\"\",\"\",Direktzahlungen!B7)","v":"Dauergrünland (DG):"},{"$f":"IF(Direktzahlungen!C7=\"\",\"\",Direktzahlungen!C7)","v":0},{"$f":"IF(Direktzahlungen!D7=\"\",\"\",Direktzahlungen!D7)","v":""},{"$f":"IF(Direktzahlungen!E7=\"\",\"\",Direktzahlungen!E7)","v":"Ökolandwirt"},{"$f":"IF(Direktzahlungen!F7=\"\",\"\",Direktzahlungen!F7)","v":""},null,{"$f":"IF(Direktzahlungen!G7=\"\",\"\",Direktzahlungen!G7)","v":""},null,{"$f":"IF(Direktzahlungen!H7=\"\",\"\",Direktzahlungen!H7)","v":"nein"},{"$f":"IF(Direktzahlungen!I7=\"\",\"\",Direktzahlungen!I7)","v":""},{"$f":"\"  \"&Direktzahlungen!K7","v":"  GLÖZ 6    Mindestbodenbedeckung"},null,null,null,{"$f":"IF(Direktzahlungen!L7=\"\",\"\",Direktzahlungen!L7)","v":0},{"$f":"IF(Direktzahlungen!M7=\"\",\"\",Direktzahlungen!M7)","v":0},{"$f":"IF(Direktzahlungen!N7=\"\",\"\",Direktzahlungen!N7)","v":0}]
[{"$f":"IF(Direktzahlungen!A9=\"\",\"\",Direktzahlungen!A9)","v":""},null,{"$f":"IF(Direktzahlungen!B8=\"\",\"\",Direktzahlungen!B8)","v":"Dauerkulturfläche (DK):"},{"$f":"IF(Direktzahlungen!C8=\"\",\"\",Direktzahlungen!C8)","v":0},{"$f":"IF(Direktzahlungen!D8=\"\",\"\",Direktzahlungen!D8)","v":""},{"$f":"IF(Direktzahlungen!E8=\"\",\"\",Direktzahlungen!E8)","v":""},{"$f":"IF(Direktzahlungen!F8=\"\",\"\",Direktzahlungen!F8)","v":""},null,{"$f":"IF(Direktzahlungen!G8=\"\",\"\",Direktzahlungen!G8)","v":""},null,{"$f":"IF(Direktzahlungen!H8=\"\",\"\",Direktzahlungen!H8)","v":""},{"$f":"IF(Direktzahlungen!I8=\"\",\"\",Direktzahlungen!I8)","v":""},{"$f":"\"  \"&Direktzahlungen!K8","v":"  GLÖZ 7    Fruchtwechsel auf Ackerland"},null,null,null,{"$f":"IF(Direktzahlungen!L8=\"\",\"\",Direktzahlungen!L8)","v":0},{"$f":"IF(Direktzahlungen!M8=\"\",\"\",Direktzahlungen!M8)","v":0},{"$f":"IF(Direktzahlungen!N8=\"\",\"\",Direktzahlungen!N8)","v":0}]
[{"$f":"IF(Direktzahlungen!A10=\"\",\"\",Direktzahlungen!A10)","v":""},null,{"$f":"IF(Direktzahlungen!B9=\"\",\"\",Direktzahlungen!B9)","v":"Förderfähige ldw. Fläche:"},{"$f":"IF(Direktzahlungen!C9=\"\",\"\",Direktzahlungen!C9)","v":0},{"$f":"IF(Direktzahlungen!D9=\"\",\"\",Direktzahlungen!D9)","v":""},{"$f":"IF(Direktzahlungen!E9=\"\",\"\",Direktzahlungen!E9)","v":""},{"$f":"IF(Direktzahlungen!F9=\"\",\"\",Direktzahlungen!F9)","v":""},null,{"$f":"IF(Direktzahlungen!G9=\"\",\"\",Direktzahlungen!G9)","v":""},null,{"$f":"IF(Direktzahlungen!H9=\"\",\"\",Direktzahlungen!H9)","v":""},{"$f":"IF(Direktzahlungen!I9=\"\",\"\",Direktzahlungen!I9)","v":""},{"$f":"\"  \"&Direktzahlungen!K9","v":"  GLÖZ 8    Brache (4% des AL)"},null,null,null,{"$f":"IF(Direktzahlungen!L9=\"\",\"\",Direktzahlungen!L9)","v":0},{"$f":"IF(Direktzahlungen!M9=\"\",\"\",Direktzahlungen!M9)","v":0},{"$f":"IF(Direktzahlungen!N9=\"\",\"\",Direktzahlungen!N9)","v":0}]
{"$rows_left_out":43}
{"sheet":"Vorlage Einstieg","index":5,"n_rows":12,"n_cols":3,"rows_kept":12,"cut":false,"hidden":false,"merged":[[11,1,11,6],[10,1,10,6],[9,1,9,6],[8,1,8,6],[6,2,6,6]]}
[]
[null,"GAP - Prämienrechner Bayern"]
[null,"Bayerische Landesanstalt für Landwirtschaft"]
[null,"Copyright 2022 Institut für Agrarökonomie"]
[null,"                            Agrarökonomie@lfl.bayern.de, Tel.: 08161 8640-1111                   "]
[]
[null,"Wichtig:","Die nachfolgend genannten Regelungen stehen unter dem Genehmigungsvorbehalt durch die EU-KOM. Derzeit besteht keine Rechtssicherheit, weil sich im Rahmen dieses Genehmigungsverfahrens noch Änderungen bei den genannten Regelungen ergeben können.\n\nDie Ausnahmeregelungen zur Aussetzung von GLÖZ 7 und GLÖZ 8 im Jahr 2023 können nicht berücksichtigt werden."]
[]
[null,"Der Prämienrechner besteht aus den Teilen \"Direktzahlungen mit den Konditionalitäten\" und den \"Ökoregelungen\" unter Berücksichtigung von Kostenansätzen."]
[null,"Grüne Zellen: Hier können die betriebsindividuellen Werte für die Berechnung der Zahlungen und der ggf. entstehenden Kosten eingetragen werden."]
{"$rows_left_out":3}
{"sheet":"Parameter","index":6,"n_rows":12,"n_cols":9,"rows_kept":12,"cut":false,"hidden":false,"merged":[]}
[null,"ja"]
[null,"nein"]
[]
["Formel","Fenster","Zeile","Spalte","IDB","F_FB","Z_FB","S_FB"]
[1,4,{"$f":"ROW(Formeln!C20)","v":20},{"$f":"COLUMN(Formeln!C20)","v":3},1,3,{"$f":"ROW(Ökoregelungen!I5)","v":5},{"$f":"COLUMN(Ökoregelungen!I5)","v":9},{"$f":"Formeln!M20","v":"1a  -  Aufstockung nichtproduktives AL"}]
[2,4,{"$f":"ROW(Formeln!C51)","v":51},{"$f":"COLUMN(Formeln!C51)","v":3},1,2,{"$f":"ROW(Direktzahlungen!L9)","v":9},{"$f":"COLUMN(Direktzahlungen!L9)","v":12},{"$f":"Direktzahlungen!K9","v":"GLÖZ 8    Brache (4% des AL)"}]
[3,4,{"$f":"ROW(Formeln!C82)","v":82},{"$f":"COLUMN(Formeln!C82)","v":3},1,2,{"$f":"ROW(Direktzahlungen!M9)","v":9},{"$f":"COLUMN(Direktzahlungen!M9)","v":13},{"$f":"Direktzahlungen!K9","v":"GLÖZ 8    Brache (4% des AL)"}]
[4,4,{"$f":"ROW(Formeln!C113)","v":113},{"$f":"COLUMN(Formeln!C113)","v":3},1,2,{"$f":"ROW(Direktzahlungen!M11)","v":11},{"$f":"COLUMN(Direktzahlungen!M11)","v":13}]
[5,4,{"$f":"ROW(Formeln!C144)","v":144},{"$f":"COLUMN(Formeln!C144)","v":3},1,2,{"$f":"ROW(Direktzahlungen!M12)","v":12},{"$f":"COLUMN(Direktzahlungen!M12)","v":13}]
[6,4,{"$f":"ROW(Formeln!C175)","v":175},{"$f":"COLUMN(Formeln!C175)","v":3},1,2,{"$f":"ROW(Direktzahlungen!M13)","v":13},{"$f":"COLUMN(Direktzahlungen!M13)","v":13}]
{"$rows_left_out":3}
{"sheet":"Konditionalität","index":7,"n_rows":13,"n_cols":8,"rows_kept":13,"cut":false,"hidden":false,"merged":[]}
[]
[]
[null,"Kosten für Erfüllung der Konditionalität ",null,null,null,"ha","Kosten € je ha","Kosten € je Betrieb"]
[null,"GLÖZ 1","Erhalt von Dauergrünland",null,null,{"$f":"#REF!","v":{"$error":"#REF!"}},200,{"$f":"+F4*G4","v":{"$error":"#REF!"}}]
[null,"GLÖZ 2","Schutz von Feuchtgebieten und Mooren",null,null,1,200,200]
[null,"GLÖZ 3","Pufferstreifen an Gewässerläufen",null,null,null,null,0]
[null,"GLÖZ 4",null,null,null,null,200,0]
[null,"GLÖZ 5",null,null,null,null,null,0]
[null,"GLÖZ 6","Mindestbodenbedeckung",null,null,1,200,200]
[null,"GLÖZ 7","Fruchtwechsel",null,null,1,200,200]
{"$rows_left_out":4}
{"sheet":"Hilfe","index":8,"n_rows":59,"n_cols":6,"rows_kept":59,"cut":false,"hidden":false,"merged":[]}
[1,"Bedingung: Keine Abgabe von Milch oder Milchprodukten im Betrieb, mind. 3 Tiere",null,70]
[2,"mind. 6 Tiere, mind. 10 Monate alt",null,70]
[3,"Nur soweit die GLÖZ-Vorschriften ab 2023 über die 2021 geltenden hinausgehen!",null,70]
[4,"Rechtsgrundlagen:\n\n- Gesetz zur Durchführung der im Rahmen der Gemeinsamen Agrarpolitik geltenden Konditionalität (GAP-Konditionalitäten-Gesetz – GAPKondG)\n\n- Verordnung zur Durchführung der im Rahmen der Gemeinsamen Agrarpolitik geltenden Konditionalität (GAP-Konditionalitäten-Verordnung – GAPKondV)","GLÖZ 1",180]
[5,"GLÖZ 5: Ackerland (AL) in ha des Betriebes. ","GLÖZ 5",60]
[6,{"$f":"E6&\" \"&F6","v":"Die notwendige Fläche für den Fruchtwechsel ist der Umfang des Ackerlandes ohne Landschaftselemente und Pufferstreifen auf Ackerland. Kein Fruchtwechsel gemäß GLÖZ 7 ist notwendig, wenn es sich um einen Ökobetrieb handelt oder wenn gleichzeitig die LF maximal 50 ha und der Grünlandanteil mindestens 75% umfasst. \n\nDie Daten Ihres Betriebes: \n          Ökobetrieb: nein\n          AL: 0 ha,\n          LF: 0 ha,\n          Grünlandanteil: 0 %"},"GLÖZ 7",200,"Die notwendige Fläche für den Fruchtwechsel ist der Umfang des Ackerlandes ohne Landschaftselemente und Pufferstreifen auf Ackerland. Kein Fruchtwechsel gemäß GLÖZ 7 ist notwendig, wenn es sich um einen Ökobetrieb handelt oder wenn gleichzeitig die LF maximal 50 ha und der Grünlandanteil mindestens 75% umfasst.",{"$f":"\"\n\nDie Daten Ihres Betriebes: \n          Ökobetrieb: \"&Direktzahlungen!H7&\"\n          AL: \"&Direktzahlungen!C3&\" ha,\n\"&\"          LF: \"&Direktzahlungen!C9&\" ha,\n\"&\"          Grünlandanteil: \"&IF(Direktzahlungen!C9=0,0,ROUND(Direktzahlungen!C7/Direktzahlungen!C9*100,2))&\" %\"","v":"\n\nDie Daten Ihres Betriebes: \n          Ökobetrieb: nein\n          AL: 0 ha,\n          LF: 0 ha,\n          Grünlandanteil: 0 %"}]
[7,{"$f":"E7&\" \"&F7","v":"Die stillzulegende Fläche umfasst 4% des Ackerlandes ohne die Fläche für Landschaftselemente und Pufferstreifen auf Ackerland. Kein Ackerland muss stillgelegt werden,  wenn entweder das Ackerland maximal 10 ha oder gleichzeitig die LF maximal 50 ha und der Grünlandanteil mindestens 75% umfasst. \n\nDie Daten Ihres Betriebes: \n          AL: 0 ha,\n          LF: 0 ha,\n          Grünlandanteil: 0 %"},"GLÖZ 8",180,"Die stillzulegende Fläche umfasst 4% des Ackerlandes ohne die Fläche für Landschaftselemente und Pufferstreifen auf Ackerland. Kein Ackerland muss stillgelegt werden,  wenn entweder das Ackerland maximal 10 ha oder gleichzeitig die LF maximal 50 ha und der Grünlandanteil mindestens 75% umfasst.",{"$f":"\"\n\nDie Daten Ihres Betriebes: \n          AL: \"&Direktzahlungen!C3&\" ha,\n\"&\"          LF: \"&Direktzahlungen!C9&\" ha,\n\"&\"          Grünlandanteil: \"&IF(Direktzahlungen!C9=0,0,ROUND(Direktzahlungen!C7/Direktzahlungen!C9*100,2))&\" %\"","v":"\n\nDie Daten Ihres Betriebes: \n          AL: 0 ha,\n          LF: 0 ha,\n          Grünlandanteil: 0 %"}]
[8,"GLÖZ 9: ha LF des Betriebes in Schutzgebieten",null,60]
[9,"1. Januar bis 31. August\n\na) Sommergetreide, einschließlich Mais,\nb) Leguminosen, einschließlich Gemenge, außer Ackerfutter,\nc) Sommer-Ölsaaten,\nd) Hackfrüchte,\ne) Feldgemüse",null,160]
[10,"1. Januar bis 15. November\n\nDieser Zeitraum endet mit dem Zeitpunkt der letzten Ernte im Antragsjahr, sofern nach der Ernte im Antragsjahr eine Bodenbearbeitung zur Vorbereitung des Anbaus einer Folgekul-tur erfolgt, jedoch frühestens mit dem 31. August.",null,160]
{"$rows_left_out":50}
{"sheet":"Rech_öko","index":9,"n_rows":15,"n_cols":11,"rows_kept":15,"cut":false,"hidden":false,"merged":[]}
["Eco-scemes",null,null,"Einheit",">","<=",null,2023,2024,2025,2026]
["1a","Stufe 1","<=1%","€/ha",9.9999999000000006E-2,{"$f":"B6*0.01","v":0},{"$f":"IF(F6>E2,MIN(F2,F6),0)","v":0},1300]
[null,"Stufe 2",">1% und <=2%","€/ha",{"$f":"B6*0.01","v":0},{"$f":"B6*0.02","v":0},{"$f":"IF(F6>E2,MIN(F3,F6-G2),0)","v":0},500]
[null,"Stufe 3",">2% und <= 6%","€/ha",{"$f":"B6*0.02","v":0},{"$f":"B6*0.06","v":0},{"$f":"IF(F6>E2,F6-G3-G2,0)","v":0},300]
[null,null,">=0,1 ha",null,null,null,null,{"$f":"SUMPRODUCT($G$2:$G$4,H2:H4)","v":0},"€ gesamt"]
[null,{"$f":"Direktzahlungen!C3","v":0},"ha AL",{"$f":"Ökoregelungen!D5","v":0},"%",{"$f":"B6*D6/100","v":0},"ha AL",{"$f":"IF(F6=0,0,H5/F6)","v":0},"€/ha"]
[]
["1d","Stufe 1","<=1%","€/ha",9.9999999000000006E-2,{"$f":"B12*0.01","v":0},{"$f":"IF(F12>E8,MIN(F8,F12),0)","v":0},900]
[null,"Stufe 2",">1% und <=2%","€/ha",{"$f":"B12*0.01","v":0},{"$f":"B12*0.02","v":0},{"$f":"IF(F12>E8,MIN(F9,F12-G8),0)","v":0},400]
[null,"Stufe 3",">2% und <= 6%","€/ha",{"$f":"B12*0.02","v":0},{"$f":"B12*0.06","v":0},{"$f":"IF(F12>E8,F12-G9-G8,0)","v":0},200]
{"$rows_left_out":6}
{"sheet":"Berechnungen","index":10,"n_rows":23,"n_cols":11,"rows_kept":23,"cut":false,"hidden":false,"merged":[]}
[]
["1a",{"$f":"Ökoregelungen!C5","v":"1a  -  Aufstockung nichtproduktives AL"}]
[null,"  Entgangener Deckungsbeitrag","€/ha",1690]
[null,"+ Kosten für Mulchen","€/ha",30]
[null,"= Kosten gesamt","€/ha",{"$f":"D3+D4","v":1720}]
[]
["1b",{"$f":"Ökoregelungen!C6","v":"1b  -  Blühflächen/-streifen auf AL nach 1a"}]
[null,"  Etablierungskosten","€/ha",165]
[null,"/ Nutzungsdauer","Jahre",1]
[null,"= Kosten gesamt",null,{"$f":"IF(D9=0,0,D8/D9)","v":165}]
{"$rows_left_out":13}