{"text_format":"1","workbook":"xlsx","n_sheets":8,"sheets":["Programm","Tiere","Futtermittel","Futtermittel unsortiert","Futtermittel alt","Hauptfrüchte","Jahr","Tabelle1"],"not_rendered":{"charts":0,"images":2,"macros":1,"external_links":0,"defined_names":1,"comments":2,"pivot_tables":0},"unopened":[],"bounds":{"document_bytes":16777216,"sheet_cells":100000,"rows_first":2000,"rows_last":500,"rows_between":2000,"halvings":0,"cell_chars":16384,"cell_head_chars":4096},"cells_cut":0,"cells_raw":0,"read":"whole","date_system":"1900"}

{"sheet":"Programm","index":0,"n_rows":230,"n_cols":60,"rows_kept":230,"cut":false,"hidden":false,"merged":[[36,5,36,6],[114,8,114,9],[117,8,117,9],[115,8,115,9],[116,8,116,9],[59,4,59,6],[60,4,60,6],[61,4,61,6],[62,4,62,6],[119,15,119,16],[113,10,113,11],[111,12,111,14],[111,8,111,9],[113,8,113,9],[112,8,112,9],[140,19,140,20],[137,19,137,20],[112,15,112,20],[126,17,126,18],[127,17,127,18],[128,17,128,18],[129,17,129,18],[138,17,138,18],[139,17,139,18],[130,19,130,20],[131,19,131,20],[117,15,117,16],[118,15,118,16],[136,19,136,20],[141,19,141,20],[118,19,118,20],[119,19,119,20],[120,19,120,20],[121,15,121,16],[122,15,122,16],[123,15,123,16],[140,15,140,16],[141,15,141,16],[121,19,121,20],[122,19,122,20],[118,17,118,18],[119,17,119,18],[120,17,120,18],[124,19,124,20],[138,19,138,20],[139,19,139,20],[141,17,141,18],[140,17,140,18],[124,15,124,16],[138,15,138,16],[139,15,139,16],[120,15,120,16],[130,17,130,18],[143,0,143,19],[43,7,45,7],[42,7,42,8],[43,8,45,8],[97,8,97,10],[98,8,98,10],[99,8,99,10],[100,8,100,10],[65,8,65,9],[65,12,65,23],[66,8,68,8],[66,9,68,9],[101,8,101,10],[102,8,102,10],[103,8,103,10],[104,8,104,10],[105,8,105,10],[99,17,99,18],[102,13,102,14],[103,13,103,14],[104,13,104,14],[105,13,105,14],[101,11,101,12],[140,0,140,7],[0,0,0,19],[1,0,1,19],[23,0,23,1],[24,0,24,1],[4,17,4,18],[5,17,5,18],[18,0,18,1],[19,0,19,1],[13,0,13,1],[14,0,14,1],[3,2,3,6],[4,2,4,12],[5,2,5,12],[6,2,6,12],[11,2,11,5],[16,2,16,5],[21,2,21,5],[12,2,12,3],[12,4,12,5],[22,4,22,5],[23,2,23,3],[24,2,24,3],[12,19,12,20],[22,2,22,3],[11,19,11,22],[13,19,13,20],[14,19,14,20],[13,21,13,22],[14,21,14,22],[106,8,106,10],[98,11,98,12],[100,13,100,14],[101,13,101,14],[105,15,105,16],[106,15,106,16],[35,8,35,15],[36,8,36,15],[97,11,97,14],[98,13,98,14],[99,13,99,14],[100,11,100,12],[18,21,18,22],[18,19,18,20],[20,17,20,18],[21,17,21,18],[28,16,28,17],[28,18,28,19],[35,20,35,22],[24,4,24,5],[17,17,17,22],[28,20,28,22],[30,20,30,22],[31,20,31,22],[32,20,32,22],[33,20,33,22],[34,20,34,22],[12,21,12,22],[33,5,33,6],[34,5,34,6],[13,17,13,18],[14,17,14,18],[29,18,29,19],[33,3,33,4],[34,3,34,4],[30,8,30,15],[31,8,31,15],[32,8,32,15],[33,8,33,15],[34,8,34,15],[36,20,36,22],[13,2,13,3],[13,4,13,5],[14,2,14,3],[14,4,14,5],[17,2,17,3],[17,4,17,5],[18,2,18,3],[18,4,18,5],[19,2,19,3],[19,4,19,5],[35,16,35,17],[36,16,36,17],[35,18,35,19],[36,18,36,19],[27,8,27,22],[28,8,28,15],[29,8,29,15],[31,16,31,17],[32,16,32,17],[33,16,33,17],[34,16,34,17],[23,4,23,5],[32,5,32,6],[141,0,141,7],[125,15,125,16],[126,15,126,16],[127,15,127,16],[128,15,128,16],[129,15,129,16],[130,15,130,16],[131,15,131,16],[137,15,137,16],[138,8,138,9],[139,8,139,9],[140,8,140,9],[141,8,141,9],[125,0,125,7],[126,0,126,7],[127,0,127,7],[129,0,129,7],[130,0,130,7],[131,0,131,7],[137,0,137,7],[138,0,138,7],[128,0,128,7],[139,0,139,7],[131,8,131,9],[123,0,123,7],[124,0,124,7],[128,8,128,9],[129,8,129,9],[130,8,130,9],[119,8,119,9],[120,8,120,9],[121,8,121,9],[122,8,122,9],[104,17,104,18],[127,19,127,20],[128,19,128,20],[129,19,129,20],[123,17,123,18],[124,17,124,18],[106,13,106,14],[125,19,125,20],[104,15,104,16],[113,19,113,20],[114,19,114,20],[115,19,115,20],[116,19,116,20],[117,19,117,20],[113,17,113,18],[114,17,114,18],[115,17,115,18],[116,17,116,18],[117,17,117,18],[126,19,126,20],[121,17,121,18],[125,17,125,18],[40,0,40,17],[42,15,42,17],[42,12,42,14],[42,10,42,11],[68,5,68,7],[67,3,67,4],[67,5,67,7],[68,3,68,4],[99,11,99,12],[99,15,99,16],[57,4,57,6],[58,4,58,6],[48,4,48,6],[49,4,49,6],[50,4,50,6],[51,4,51,6],[52,4,52,6],[53,4,53,6],[54,4,54,6],[44,0,44,2],[55,4,55,6],[56,4,56,6],[45,0,45,2],[32,3,32,4],[35,3,35,4],[36,3,36,4],[118,8,118,9],[30,18,30,19],[31,18,31,19],[32,18,32,19],[33,18,33,19],[34,18,34,19],[30,16,30,17],[58,19,62,22],[102,11,102,12],[103,11,103,12],[104,11,104,12],[105,11,105,12],[106,11,106,12],[111,10,111,11],[111,15,111,20],[113,15,113,16],[114,15,114,16],[115,15,115,16],[116,15,116,16],[35,5,35,6],[137,8,137,9],[123,8,123,9],[124,8,124,9],[125,8,125,9],[126,8,126,9],[127,8,127,9],[137,17,137,18],[136,15,136,16],[136,17,136,18],[132,15,132,16],[132,17,132,18],[133,15,133,16],[133,17,133,18],[134,15,134,16],[134,17,134,18],[135,15,135,16],[135,17,135,18],[131,17,131,18],[132,0,132,7],[133,0,133,7],[134,0,134,7],[135,0,135,7],[136,0,136,7],[132,8,132,9],[133,8,133,9],[134,8,134,9],[135,8,135,9],[136,8,136,9],[5,15,5,16],[132,19,132,20],[133,19,133,20],[134,19,134,20],[135,19,135,20],[98,15,98,16],[123,19,123,20],[122,17,122,18],[102,17,102,18],[103,17,103,18],[29,20,29,22],[97,15,97,18],[98,17,98,18],[105,17,105,18],[106,17,106,18],[100,15,100,16],[101,15,101,16],[102,15,102,16],[103,15,103,16],[29,16,29,17],[100,17,100,18],[101,17,101,18],[39,0,39,17],[47,4,47,6]]}
["Stallbilanz im schweinehaltenden Betrieb; Stand 08.09.2020",null,null,null,null,null,null,null,null,null,null,null,null,null,null,null,null,null,null,null,null,null,null,null,"ausblenden bis BG"]
["Eintragungen sind nur möglich in den gelb gekennzeichnete Felder und beim \"pull down menü\"."]
[]
["Betriebsnr.:"]
["Name:",null,null,null,null,null,null,null,null,null,null,null,null,null,null,null,"Jahr:",null,null,null,null,null,null,null,null,null,null,null,1]
["Straße/Nr.:",null,null,null,null,null,null,null,null,null,null,null,null,null,null,"LF nach DüV:",null,null,null,"ha"]
["PLZ/Ort:"]
[]
["Berechnungsergebnis - Nährstoffe in kg"]
[]
[]
[null,null,"Zukauf Tiere",null,null,null,null,null,null,null,null,null,null,null,null,null,null,null,null,"Verkauf/Abgang Tiere"]
[null,null,"N",null,"P2O5 ",null,null,null,null,null,null,null,null,null,null,null,null,null,null,"N",null,"P2O5 "]
["Betrieb",null,{"$f":"+AD108","v":0},null,{"$f":"+AE108","v":0},null,null,null,null,null,null,null,null,null,null,null,null,"Betrieb",null,{"$f":"+AG108","v":0},null,{"$f":"+AH108","v":0}]
["je ha",null,{"$f":"IF(R6=\"\",\"\",C14/$R$6)","v":""},null,{"$f":"IF(R6=\"\",\"\",E14/$R$6)","v":""},null,null,null,null,null,null,null,null,null,null,null,null,"je ha",null,{"$f":"IF(R6=\"\",\"\",T14/$R$6)","v":""},null,{"$f":"IF(R6=\"\",\"\",V14/$R$6)","v":""}]
[]
[null,null,"Zukauf Futter"]
[null,null,"N",null,"P2O5 ",null,null,null,null,null,null,null,null,null,null,null,null,"Nährstoffausscheidung brutto (kg)"]
["Betrieb",null,{"$f":"+AD143","v":0},null,{"$f":"+AE143","v":0},null,null,null,null,null,null,null,null,null,null,null,null,null,null,"tatsächlich ",null," Faustzahlen",null,null,null,null,"% Nährstoffausscheidung"]
["je ha",null,{"$f":"IF(R6=\"\",\"\",C19/$R$6)","v":""},null,{"$f":"IF(R6=\"\",\"\",E19/$R$6)","v":""},null,null,null,null,null,null,null,null,null,null,null,null,null,null,"N","P2O5 ","N","P2O5 ",null,null,null,"N","P"]
[null,null,null,null,null,null,null,null,null,null,null,null,null,null,null,null,null,"Betrieb",null,{"$f":"+C19+C14+C24-T14","v":0},{"$f":"+E19+E14+E24-V14","v":0},{"$f":"+AA108","v":0},{"$f":"+AB108","v":0},null,null,null,{"$f":"+T21/V21","v":{"$error":"#DIV/0!"}},{"$f":"+U21/W21","v":{"$error":"#DIV/0!"}}]
[null,null,"Eigenerz. Futter",null,null,null,null,null,null,null,null,null,null,null,null,null,null,"je ha",null,{"$f":"IF(R6=\"\",\"\",T21/$R$6)","v":""},{"$f":"IF(R6=\"\",\"\",U21/$R$6)","v":""},{"$f":"IF(R6=\"\",\"\",V21/$R$6)","v":""},{"$f":"IF(R6=\"\",\"\",W21/$R$6)","v":""}]
[null,null,"N",null,"P2O5 "]
["Betrieb",null,{"$f":"+AD94","v":0},null,{"$f":"+AE94","v":0}]
["je ha",null,{"$f":"IF(R6=\"\",\"\",C24/$R$6)","v":""},null,{"$f":"IF(R6=\"\",\"\",E24/$R$6)","v":""}]
[]
[]
["Auswertung der Eingaben:",null,null,null,null,null,null,null,"ERGEBNIS: Nährstoffausscheidung in der Schweinehaltung je mittlerer Jahresbestand"]
[null,null,null,null,null,null,null,null,"Tierhaltung",null,null,null,null,null,null,null,"N",null,"P2O5",null,"Fütterung"]
[null,null,null,null,null,null,null,null,null,null,null,null,null,null,null,null,"kg/Tier",null,"kg/Tier",null,"stark N/P-red."]
[null,null,null,null,null,null,null,null,{"$f":"IF(AN101=0,\" \",IF(I101=\"\",\"\",AN101))","v":" "},null,null,null,null,null,null,null,{"$f":"IF($T$21=0,\"\",IF(I101=\"\",\"\",AO101*$AA$21))","v":""},null,{"$f":"IF($T$21=0,\"\",IF(I101=\"\",\"\",AP101*$AB$21))","v":""},null,{"$f":"IF(AM101=1,\"\",IF(I101=\"\",\"\",IF(BG101=30,\"evt. möglich\",IF(AZ101=3,\"ja\",\"nein\"))))","v":""}]
["Nur für Mastschweinebetriebe",null,null,null,null,null,null,null," ",null,null,null,null,null,null,null,"",null,"",null,""]
["Futtereinsatz:",null,null,{"$f":"+Z94+Z143","v":0},null,"dt TM",null,null," ",null,null,null,null,null,null,null,"",null,"",null,""]
["davon eigenerzeugt:",null,null,{"$f":"+Z94","v":0},null,"dt TM",null,null," ",null,null,null,null,null,null,null,"",null,"",null,""]
["davon Zukauf:",null,null,{"$f":"+Z143","v":0},null,"dt TM",null,null," ",null,null,null,null,null,null,null,"",null,"",null,""]
["Zuwachs:",null,null,{"$f":"+(AG108-AD108)/2.56","v":0},null,"dt",null,null," ",null,null,null,null,null,null,null,"",null,"",null,""]
["Futteraufwand:",null,null,{"$f":"IF(D36=0,\"\",D33/D36)","v":""},null,"kg/kg TM",null,null," ",null,null,null,null,null,null,null,"",null,"",null,""]
[]
[]
["Angaben zur Flächennutzung "]
["FM = Frischmasse, TM = Trockenmasse, TS = Trockensubstanz (TM und TS ist das selbe)"]
[]
[null,null,null,null,null,null,null,"Fläche ",null,"Ertrag","Trockensub.",null,"Rohproteingehalt",null,null,"Nährstoffgehalt",null,null,null,"Umrechnung:"]
[null,null,null,null,null,null,null,"gesamt","davon Futter",null,"TS*","TS","Rohpr.*","Rohpr.","Rohpr.",null,"kg/dt FM",null,null,"Berechnung des N-Gehalts aus dem ",null,null,null,null,null,null,"Summe Betrieb"]
["Hauptfrucht ",null,null,null,"Eigene ",null,null,null,null,"FM","%","%","% TM","% TM","% FM",null,null,null,null,"angegebenen Rohprotein % TM:",null,null,null,null,null,"Futter ","Futter ",null,null,"kg/dt"]
[null,null,null,null," Bemerkung",null,null,null,null,null,"der","der","falls",null,null,"N","P","P2O5 ",null,"angegebener RP-Gehalt % in TM / 6,25 ",null,null,null,null,null,"Menge","Menge",null,"FM","FM","FM",null,null,null,null,null,null,null,null,null,"Rp","N","P2O5","TS","Rp"]
[null,null,null,null,null,null,null,"ha","ha","dt/ha","FM","FM","bekannt",null,null,null,null,null,null," * angegebene TM in % / 100 ",null,null,null,null,null,"dt TM","dt FM","TS","Rp","N","P2O5",null,null,null,null,null,null,null,null,null,"TM",null,null,null,"FM"]
[null,null,null,null,null,null,null,null,null,null,null,{"$f":"IF($AM48=1,\" \",IF(K48>0,K48,AR48))","v":" "},null,{"$f":"IF($AM48=1,\" \",IF(M48>0,M48,AO48))","v":" "},{"$f":"IF($AM48=1,\" \",N48*L48/100)","v":" "},{"$f":"IF($AM48=1,\" \",(AP48/AR48*L48)/AO48*N48)","v":" "},{"$f":"IF($AM48=1,\" \",R48/2.291)","v":" "},{"$f":"IF($AM48=1,\" \",(AQ48/AR48*L48))","v":" "},null," = Stickstoffgehalt in kg/dt FM",null,null,null,null,null,{"$f":"+AA48*AB48/100","v":0},{"$f":"+J48*I48","v":0},{"$f":"IF(AA48=0,0,L48)","v":0},{"$f":"IF(AA48=0,0,O48)","v":0},{"$f":"IF(AA48=0,0,AA48*P48)","v":0},{"$f":"IF(AA48=0,0,AA48*R48)","v":0},null,null,null,null,null,null,null,1,{"$f":"INDEX(Hauptfrüchte!B$4:B$86,$AM48)","v":0},{"$f":"INDEX(Hauptfrüchte!C$4:C$86,$AM48)","v":0},{"$f":"INDEX(Hauptfrüchte!D$4:D$86,$AM48)","v":0},{"$f":"INDEX(Hauptfrüchte!E$4:E$86,$AM48)","v":0},{"$f":"INDEX(Hauptfrüchte!F$4:F$86,$AM48)","v":0},{"$f":"INDEX(Hauptfrüchte!G$4:G$86,$AM48)","v":0}]
[null,null,null,null,null,null,null,null,null,null,null," ",null," "," "," "," "," ",null,"Berechnung des Rohprotein % TM aus ",null,null,null,null,null,0,{"$f":"+J49*I49","v":0},{"$f":"IF(AA49=0,0,L49)","v":0},{"$f":"IF(AA49=0,0,O49)","v":0},{"$f":"IF(AA49=0,0,AA49*P49)","v":0},{"$f":"IF(AA49=0,0,AA49*R49)","v":0},null,null,null,null,null,null,null,1,{"$f":"INDEX(Hauptfrüchte!B$4:B$86,$AM49)","v":0},{"$f":"INDEX(Hauptfrüchte!C$4:C$86,$AM49)","v":0},{"$f":"INDEX(Hauptfrüchte!D$4:D$86,$AM49)","v":0},{"$f":"INDEX(Hauptfrüchte!E$4:E$86,$AM49)","v":0},{"$f":"INDEX(Hauptfrüchte!F$4:F$86,$AM49)","v":0},{"$f":"INDEX(Hauptfrüchte!G$4:G$86,$AM49)","v":0}]
[null,null,null,null,null,null,null,null,null,null,null," ",null," "," "," "," "," ",null,"dem angegebenen Stickstoffgehalt in FM:",null,null,null,null,null,0,0,0,0,0,0,null,null,null,null,null,null,null,1,{"$f":"INDEX(Hauptfrüchte!B$4:B$86,$AM50)","v":0},{"$f":"INDEX(Hauptfrüchte!C$4:C$86,$AM50)","v":0},{"$f":"INDEX(Hauptfrüchte!D$4:D$86,$AM50)","v":0},{"$f":"INDEX(Hauptfrüchte!E$4:E$86,$AM50)","v":0},{"$f":"INDEX(Hauptfrüchte!F$4:F$86,$AM50)","v":0},{"$f":"INDEX(Hauptfrüchte!G$4:G$86,$AM50)","v":0}]
[null,null,null,null,null,null,null,null,null,null,null," ",null," "," "," "," "," ",null,"Stickstoffgehalt in kg/dt FM * 6,25 ",null,null,null,null,null,0,0,0,0,0,0,null,null,null,null,null,null,null,1,{"$f":"INDEX(Hauptfrüchte!B$4:B$86,$AM51)","v":0},{"$f":"INDEX(Hauptfrüchte!C$4:C$86,$AM51)","v":0},{"$f":"INDEX(Hauptfrüchte!D$4:D$86,$AM51)","v":0},{"$f":"INDEX(Hauptfrüchte!E$4:E$86,$AM51)","v":0},{"$f":"INDEX(Hauptfrüchte!F$4:F$86,$AM51)","v":0},{"$f":"INDEX(Hauptfrüchte!G$4:G$86,$AM51)","v":0}]
[null,null,null,null,null,null,null,null,null,null,null," ",null," "," "," "," "," ",null," / angegebene TM in % / 100 ",null,null,null,null,null,0,0,0,0,0,0,null,null,null,null,null,null,null,1,{"$f":"INDEX(Hauptfrüchte!B$4:B$86,$AM52)","v":0},{"$f":"INDEX(Hauptfrüchte!C$4:C$86,$AM52)","v":0},{"$f":"INDEX(Hauptfrüchte!D$4:D$86,$AM52)","v":0},{"$f":"INDEX(Hauptfrüchte!E$4:E$86,$AM52)","v":0},{"$f":"INDEX(Hauptfrüchte!F$4:F$86,$AM52)","v":0},{"$f":"INDEX(Hauptfrüchte!G$4:G$86,$AM52)","v":0}]
[null,null,null,null,null,null,null,null,null,null,null," ",null," "," "," "," "," ",null," = Rohprotein % TM",null,null,null,null,null,0,0,0,0,0,0,null,null,null,null,null,null,null,1,{"$f":"INDEX(Hauptfrüchte!B$4:B$86,$AM53)","v":0},{"$f":"INDEX(Hauptfrüchte!C$4:C$86,$AM53)","v":0},{"$f":"INDEX(Hauptfrüchte!D$4:D$86,$AM53)","v":0},{"$f":"INDEX(Hauptfrüchte!E$4:E$86,$AM53)","v":0},{"$f":"INDEX(Hauptfrüchte!F$4:F$86,$AM53)","v":0},{"$f":"INDEX(Hauptfrüchte!G$4:G$86,$AM53)","v":0}]
[null,null,null,null,null,null,null,null,null,null,null," ",null," "," "," "," "," ",null,"Weizen Umrechnungsfaktor 5,7 statt 6,25 ",null,null,null,null,null,0,0,0,0,0,0,null,null,null,null,null,null,null,1,{"$f":"INDEX(Hauptfrüchte!B$4:B$86,$AM54)","v":0},{"$f":"INDEX(Hauptfrüchte!C$4:C$86,$AM54)","v":0},{"$f":"INDEX(Hauptfrüchte!D$4:D$86,$AM54)","v":0},{"$f":"INDEX(Hauptfrüchte!E$4:E$86,$AM54)","v":0},{"$f":"INDEX(Hauptfrüchte!F$4:F$86,$AM54)","v":0},{"$f":"INDEX(Hauptfrüchte!G$4:G$86,$AM54)","v":0}]
[null,null,null,null,null,null,null,null,null,null,null," ",null," "," "," "," "," ",null,"Umrechnung P auf P2O5:",null,null,null,null,null,0,0,0,0,0,0,null,null,null,null,null,null,null,1,{"$f":"INDEX(Hauptfrüchte!B$4:B$86,$AM55)","v":0},{"$f":"INDEX(Hauptfrüchte!C$4:C$86,$AM55)","v":0},{"$f":"INDEX(Hauptfrüchte!D$4:D$86,$AM55)","v":0},{"$f":"INDEX(Hauptfrüchte!E$4:E$86,$AM55)","v":0},{"$f":"INDEX(Hauptfrüchte!F$4:F$86,$AM55)","v":0},{"$f":"INDEX(Hauptfrüchte!G$4:G$86,$AM55)","v":0}]
[null,null,null,null,null,null,null,null,null,null,null," ",null," "," "," "," "," ",null,"P-Gehalt * 2,291 = P2O5-Gehalt",null,null,null,null,null,0,0,0,0,0,0,null,null,null,null,null,null,null,1,{"$f":"INDEX(Hauptfrüchte!B$4:B$86,$AM56)","v":0},{"$f":"INDEX(Hauptfrüchte!C$4:C$86,$AM56)","v":0},{"$f":"INDEX(Hauptfrüchte!D$4:D$86,$AM56)","v":0},{"$f":"INDEX(Hauptfrüchte!E$4:E$86,$AM56)","v":0},{"$f":"INDEX(Hauptfrüchte!F$4:F$86,$AM56)","v":0},{"$f":"INDEX(Hauptfrüchte!G$4:G$86,$AM56)","v":0}]
[null,null,null,null,null,null,null,null,null,null,null," ",null," "," "," "," "," ",null,null,null,null,null,null,null,0,0,0,0,0,0,null,null,null,null,null,null,null,1,{"$f":"INDEX(Hauptfrüchte!B$4:B$86,$AM57)","v":0},{"$f":"INDEX(Hauptfrüchte!C$4:C$86,$AM57)","v":0},{"$f":"INDEX(Hauptfrüchte!D$4:D$86,$AM57)","v":0},{"$f":"INDEX(Hauptfrüchte!E$4:E$86,$AM57)","v":0},{"$f":"INDEX(Hauptfrüchte!F$4:F$86,$AM57)","v":0},{"$f":"INDEX(Hauptfrüchte!G$4:G$86,$AM57)","v":0}]
[null,null,null,null,null,null,null,null,null,null,null," ",null," "," "," "," "," ",null,null,null,null,null,null,null,0,0,0,0,0,0,null,null,null,null,null,null,null,1,{"$f":"INDEX(Hauptfrüchte!B$4:B$86,$AM58)","v":0},{"$f":"INDEX(Hauptfrüchte!C$4:C$86,$AM58)","v":0},{"$f":"INDEX(Hauptfrüchte!D$4:D$86,$AM58)","v":0},{"$f":"INDEX(Hauptfrüchte!E$4:E$86,$AM58)","v":0},{"$f":"INDEX(Hauptfrüchte!F$4:F$86,$AM58)","v":0},{"$f":"INDEX(Hauptfrüchte!G$4:G$86,$AM58)","v":0}]
[null,null,null,null,null,null,null,null,null,null,null," ",null," "," "," ",null,{"$f":"IF(Q59=\"\",\"\",Q59*2.291)","v":""},null,"P2O5 Nährstoffgehalt muss mit Angaben in der Nährstoffbilanz übereinstimmen",null,null,null,null,null,0,0,0,0,0,0,null,null,null,null,null,null,null,1,{"$f":"INDEX(Hauptfrüchte!B$4:B$86,$AM59)","v":0},{"$f":"INDEX(Hauptfrüchte!C$4:C$86,$AM59)","v":0},{"$f":"INDEX(Hauptfrüchte!D$4:D$86,$AM59)","v":0},{"$f":"INDEX(Hauptfrüchte!E$4:E$86,$AM59)","v":0},{"$f":"INDEX(Hauptfrüchte!F$4:F$86,$AM59)","v":0},{"$f":"INDEX(Hauptfrüchte!G$4:G$86,$AM59)","v":0}]
[null,null,null,null,null,null,null,null,null,null,null," ",null,{"$f":"IF($AM60=1,\" \",IF(M60>0,M60,AO60))","v":" "},{"$f":"IF($AM60=1,\" \",N60*L60/100)","v":" "},{"$f":"IF($AM60=1,\" \",(AP60/AR60*L60)/AO60*N60)","v":" "},null,{"$f":"IF(Q60=\"\",\"\",Q60*2.291)","v":""},null,null,null,null,null,null,null,0,{"$f":"+J60*I60","v":0},{"$f":"IF(AA60=0,0,L60)","v":0},{"$f":"IF(AA60=0,0,O60)","v":0},{"$f":"IF(AA60=0,0,AA60*P60)","v":0},{"$f":"IF(AA60=0,0,AA60*R60)","v":0},null,null,null,null,null,null,null,1,{"$f":"INDEX(Hauptfrüchte!B$4:B$86,$AM60)","v":0},{"$f":"INDEX(Hauptfrüchte!C$4:C$86,$AM60)","v":0},{"$f":"INDEX(Hauptfrüchte!D$4:D$86,$AM60)","v":0},{"$f":"INDEX(Hauptfrüchte!E$4:E$86,$AM60)","v":0},{"$f":"INDEX(Hauptfrüchte!F$4:F$86,$AM60)","v":0},{"$f":"INDEX(Hauptfrüchte!G$4:G$86,$AM60)","v":0}]
[null,null,null,null,null,null,null,null,null,null,null," ",null," "," "," ",null,{"$f":"IF(Q61=\"\",\"\",Q61*2.291)","v":""},null,null,null,null,null,null,null,0,0,0,0,0,0,null,null,null,null,null,null,null,1,{"$f":"INDEX(Hauptfrüchte!B$4:B$86,$AM61)","v":0},{"$f":"INDEX(Hauptfrüchte!C$4:C$86,$AM61)","v":0},{"$f":"INDEX(Hauptfrüchte!D$4:D$86,$AM61)","v":0},{"$f":"INDEX(Hauptfrüchte!E$4:E$86,$AM61)","v":0},{"$f":"INDEX(Hauptfrüchte!F$4:F$86,$AM61)","v":0},{"$f":"INDEX(Hauptfrüchte!G$4:G$86,$AM61)","v":0}]
[null,null,null,null,null,null,null,null,null,null,null," ",null," "," "," ",null,{"$f":"IF(Q62=\"\",\"\",Q62*2.291)","v":""},null,null,null,null,null,null,null,0,0,0,0,0,0,null,null,null,null,null,null,null,1,{"$f":"INDEX(Hauptfrüchte!B$4:B$86,$AM62)","v":0},{"$f":"INDEX(Hauptfrüchte!C$4:C$86,$AM62)","v":0},{"$f":"INDEX(Hauptfrüchte!D$4:D$86,$AM62)","v":0},{"$f":"INDEX(Hauptfrüchte!E$4:E$86,$AM62)","v":0},{"$f":"INDEX(Hauptfrüchte!F$4:F$86,$AM62)","v":0},{"$f":"INDEX(Hauptfrüchte!G$4:G$86,$AM62)","v":0}]
[null,null,null,null,null,null,null,null,null,null,null," ",null," "," "," ",null,{"$f":"IF(Q63=\"\",\"\",Q63*2.291)","v":""},null,null,null,null,null,null,null,{"$f":"+AA63*AB63/100","v":0},0,0,0,{"$f":"IF(AA63=0,0,AA63*P63)","v":0},0,null,null,null,null,null,null,null,1,{"$f":"INDEX(Hauptfrüchte!B$4:B$86,$AM63)","v":0},{"$f":"INDEX(Hauptfrüchte!C$4:C$86,$AM63)","v":0},{"$f":"INDEX(Hauptfrüchte!D$4:D$86,$AM63)","v":0},{"$f":"INDEX(Hauptfrüchte!E$4:E$86,$AM63)","v":0},{"$f":"INDEX(Hauptfrüchte!F$4:F$86,$AM63)","v":0},{"$f":"INDEX(Hauptfrüchte!G$4:G$86,$AM63)","v":0}]
["Anrechenbare N-Menge bei der Düngebedarfsermittlung (fachlich) in kg N/ha (= N-Wirkung Pflanzen im Anwendungsjahr)"]
[]
[null,null,null,null,null,null,null,null,"Fläche ",null,null,null,"N-Wirkung (zur Hauptfrucht) in kg/ha",null,null,null,null,null,null,null,null,null,null,null,"Summe"]
[null,null,null,null,null,null,null,null,"gesamt","davon Futter","Ertrag","Roh-",null,null,null,null,null,null,null,null,null,null,null,null,"Betrieb"]
["Zwischen-",null,null,"Haupt- ",null,"Eigene ",null,null,null,null,null,"protein","Jul","Aug","Sep","Okt","Nov","Dez","Jan","Feb","Mrz","Apr","Mai","Jun","N (kg)"]
["fruchtgruppe",null,null,"frucht",null," Bemerkung"]
[null,null,null,null,null,null,null,null,"ha","ha","dt/ha","%"]
[{"$f":"+#REF!","v":{"$error":"#REF!"}},null,{"$f":"+AN48","v":0},null,null,{"$f":"+IF(E48=\"\",\"\",E48)","v":""},null,null,{"$f":"+H48","v":0},0,0,{"$f":"+IF(N48=\"\",\"\",N48)","v":" "},{"$f":"IF(P48>1,P48*#REF!/100*#REF!,\"\")","v":{"$error":"#VALUE!"}},{"$f":"IF(Q48>1,Q48*#REF!/100*#REF!,\"\")","v":{"$error":"#VALUE!"}},{"$f":"IF(R48>1,R48*#REF!/100*#REF!,\"\")","v":{"$error":"#VALUE!"}},{"$f":"IF(W44>1,W44*#REF!/100*#REF!,\"\")","v":""},{"$f":"IF(X48>1,X48*#REF!/100*#REF!,\"\")","v":""},{"$f":"IF(#REF!>1,#REF!*#REF!/100*#REF!,\"\")","v":{"$error":"#REF!"}},{"$f":"IF(Z48>1,Z48*#REF!/100*#REF!,\"\")","v":""},{"$f":"IF(#REF!>1,#REF!*#REF!/100*#REF!,\"\")","v":{"$error":"#REF!"}},{"$f":"IF(#REF!>1,#REF!*#REF!/100*#REF!,\"\")","v":{"$error":"#REF!"}},{"$f":"IF(#REF!>1,#REF!*#REF!/100*#REF!,\"\")","v":{"$error":"#REF!"}},{"$f":"IF(#REF!>1,#REF!*#REF!/100*#REF!,\"\")","v":{"$error":"#REF!"}},{"$f":"IF(#REF!>1,#REF!*#REF!/100*#REF!,\"\")","v":{"$error":"#REF!"}},{"$f":"SUM(M71:X71)*I71","v":{"$error":"#VALUE!"}}]
[{"$f":"+#REF!","v":{"$error":"#REF!"}},null,{"$f":"+AN49","v":0},null,null,{"$f":"+IF(E49=\"\",\"\",E49)","v":""},null,null,0,0,0,{"$f":"+IF(N49=\"\",\"\",N49)","v":" "},{"$f":"IF(P49>1,P49*#REF!/100*#REF!,\"\")","v":{"$error":"#VALUE!"}},{"$f":"IF(Q49>1,Q49*#REF!/100*#REF!,\"\")","v":{"$error":"#VALUE!"}},{"$f":"IF(R49>1,R49*#REF!/100*#REF!,\"\")","v":{"$error":"#VALUE!"}},{"$f":"IF(W45>1,W45*#REF!/100*#REF!,\"\")","v":""},{"$f":"IF(X49>1,X49*#REF!/100*#REF!,\"\")","v":""},{"$f":"IF(#REF!>1,#REF!*#REF!/100*#REF!,\"\")","v":{"$error":"#REF!"}},{"$f":"IF(Z49>1,Z49*#REF!/100*#REF!,\"\")","v":""},{"$f":"IF(#REF!>1,#REF!*#REF!/100*#REF!,\"\")","v":{"$error":"#REF!"}},{"$f":"IF(#REF!>1,#REF!*#REF!/100*#REF!,\"\")","v":{"$error":"#REF!"}},{"$f":"IF(#REF!>1,#REF!*#REF!/100*#REF!,\"\")","v":{"$error":"#REF!"}},{"$f":"IF(#REF!>1,#REF!*#REF!/100*#REF!,\"\")","v":{"$error":"#REF!"}},{"$f":"IF(#REF!>1,#REF!*#REF!/100*#REF!,\"\")","v":{"$error":"#REF!"}},{"$f":"SUM(M72:X72)*I72","v":{"$error":"#VALUE!"}}]
[{"$f":"+#REF!","v":{"$error":"#REF!"}},null,{"$f":"+AN50","v":0},null,null,{"$f":"+IF(E50=\"\",\"\",E50)","v":""},null,null,0,0,0,{"$f":"+IF(N50=\"\",\"\",N50)","v":" "},{"$f":"IF(P50>1,P50*#REF!/100*#REF!,\"\")","v":{"$error":"#VALUE!"}},{"$f":"IF(Q50>1,Q50*#REF!/100*#REF!,\"\")","v":{"$error":"#VALUE!"}},{"$f":"IF(R50>1,R50*#REF!/100*#REF!,\"\")","v":{"$error":"#VALUE!"}},{"$f":"IF(W46>1,W46*#REF!/100*#REF!,\"\")","v":""},{"$f":"IF(X50>1,X50*#REF!/100*#REF!,\"\")","v":""},{"$f":"IF(#REF!>1,#REF!*#REF!/100*#REF!,\"\")","v":{"$error":"#REF!"}},{"$f":"IF(Z50>1,Z50*#REF!/100*#REF!,\"\")","v":""},{"$f":"IF(#REF!>1,#REF!*#REF!/100*#REF!,\"\")","v":{"$error":"#REF!"}},{"$f":"IF(#REF!>1,#REF!*#REF!/100*#REF!,\"\")","v":{"$error":"#REF!"}},{"$f":"IF(#REF!>1,#REF!*#REF!/100*#REF!,\"\")","v":{"$error":"#REF!"}},{"$f":"IF(#REF!>1,#REF!*#REF!/100*#REF!,\"\")","v":{"$error":"#REF!"}},{"$f":"IF(#REF!>1,#REF!*#REF!/100*#REF!,\"\")","v":{"$error":"#REF!"}},{"$f":"SUM(M73:X73)*I73","v":{"$error":"#VALUE!"}}]
[null,null,null,null,null,null,null,null,null,null,null,null,null,null,null,null,null,null,null,null,null,null,null,null,{"$f":"SUM(M74:X74)*L74","v":0}]
[]
[]
[]
[]
[]
[]
[]
[]
[]
[]
[]
[]
[]
["Grünland"]
[]
[]
[null,null,null,null,null,null,null,null,null,null,null,null,null,null,null,null,null,null,null,null,"Summe Betrieb kg N",null,null,null,{"$f":"SUM(Y71:Y90)","v":{"$error":"#VALUE!"}}]
[null,null,null,null,null,null,null,null,null,null,null,null,null,null,null,null,null,null,null,null,"Mittel Betrieb % N-Wirkung",null,null,null,{"$f":"+Y91/(#REF!*#REF!)*100","v":{"$error":"#VALUE!"}}]
[]
["* falls bekannt (bei keiner Angabe werden die Basisdaten verwendet)",null,null,null,null,null,null,null,null,null,null,null,null,null,null,null,null,null,null,null,null,null,null,null,null,{"$f":"SUM(Z48:Z93)","v":0},{"$f":"SUM(AA48:AA93)","v":0},{"$f":"+(AA48*AB48+AA49*AB49+AA50*AB50+AA51*AB51+AA52*AB52+AA53*AB53+AA54*AB54+AA55*AB55+AA56*AB56+AA57*AB57+AA58*AB58+AA59*AB59+AA62*AB62+AA63*AB63)/AA94","v":{"$error":"#DIV/0!"}},{"$f":"+(AA48*AC48+AA49*AC49+AA50*AC50+AA51*AC51+AA52*AC52+AA53*AC53+AA54*AC54+AA55*AC55+AA56*AC56+AA57*AC57+AA58*AC58+AA59*AC59+AA62*AC62+AA63*AC63)/AA94","v":{"$error":"#DIV/0!"}},{"$f":"SUM(AD48:AD93)","v":0},{"$f":"SUM(AE48:AE93)","v":0},"Summe Betrieb",null,null,null,null,null,null,null,null,{"$f":"SUM(AO48:AO93)","v":0},{"$f":"SUM(AP48:AP93)","v":0},{"$f":"SUM(AQ48:AQ93)","v":0}]
[null,null,null,null,null,null,null,null,null,null,null,null,null,null,null,null,null,null,null,null,null,null,null,null,null,null,null,null,{"$f":"+AC94/AB94*88","v":{"$error":"#DIV/0!"}},null,null,"Rp bei 88 % TS",null,null,null,null,null,null,null,null,null,null,null,null,null,null,null,null,null,null,null,null,null,null,null,null,null,null,null," "]
["Tierhaltung"]
[]
[null,null,null,null,null,null,null,null,"Mittlerer",null,null,"Zukauf",null,null,null,"Verkauf/Abgang"]
["Tierhaltung",null,null,null,null,null,null,null,"Jahresbestand",null,null,"Anzahl",null,"kg LG",null,"Anzahl",null,"kg LG",null,null,null,null,null,null,null,null,"Nährstoffauscheidung",null,null,"Zukauf",null,null,"Verkauf"]
[null,null,null,null,null,null,null,null,"Anzahl Tiere",null,null,"Tiere",null,"je Tier",null,"Tiere",null,"je Tier",null,null,null,null,null,null,null,null,"N","P2O5","K2O","N","P2O5","K2O","N","P2O5","K2O",null,null,null,null,null,null,null,null,null,null,null,null,null,null,"n","p","summe",null,null,null,null,null,null,"summe"]
[null,null,null,null,null,null,null,null,null,null,null,null,null,null,null,null,null,null,null,null,null,null,null,null,null,null,{"$f":"+$I101*AO101","v":0},0,0,{"$f":"+$L101*$N101/100*AR101","v":0},0,0,{"$f":"+$P101*$R101/100*AR101","v":0},0,0,null,null,null,1,{"$f":"INDEX(Tiere!A$6:A$81,$AM101)","v":0},{"$f":"INDEX(Tiere!C$6:C$81,$AM101)","v":0},{"$f":"INDEX(Tiere!D$6:D$81,$AM101)","v":0},{"$f":"INDEX(Tiere!E$6:E$81,$AM101)","v":0},{"$f":"INDEX(Tiere!F$6:F$81,$AM101)","v":0},{"$f":"INDEX(Tiere!G$6:G$81,$AM101)","v":0},{"$f":"INDEX(Tiere!H$6:H$81,$AM101)","v":0},{"$f":"INDEX(Tiere!I$6:I$81,$AM101)","v":0},{"$f":"INDEX(Tiere!J$6:J$81,$AM101)","v":0},{"$f":"INDEX(Tiere!K$6:K$81,$AM101)","v":0},{"$f":"IF(AU101>$AA$21,1,0)","v":{"$error":"#DIV/0!"}},{"$f":"IF(AV101>$AB$21,1,0)","v":{"$error":"#DIV/0!"}},{"$f":"SUM(AW101:AY101)","v":{"$error":"#DIV/0!"}},null,{"$f":"INDEX(Tiere!L$6:L$81,$AM101)","v":0},{"$f":"INDEX(Tiere!M$6:M$81,$AM101)","v":0},{"$f":"INDEX(Tiere!N$6:N$81,$AM101)","v":0},{"$f":"IF(BB101>$AA$21,10,0)","v":{"$error":"#DIV/0!"}},{"$f":"IF(BC101>$AB$21,10,0)","v":{"$error":"#DIV/0!"}},{"$f":"+BF101+BE101+BD101","v":{"$error":"#DIV/0!"}}]
[null,null,null,null,null,null,null,null,null,null,null,null,null,null,null,null,null,null,null,null,null,null,null,null,null,null,0,0,0,0,0,0,0,0,0,null,null,null,1,{"$f":"INDEX(Tiere!A$6:A$81,$AM102)","v":0},{"$f":"INDEX(Tiere!C$6:C$81,$AM102)","v":0},{"$f":"INDEX(Tiere!D$6:D$81,$AM102)","v":0},{"$f":"INDEX(Tiere!E$6:E$81,$AM102)","v":0},{"$f":"INDEX(Tiere!F$6:F$81,$AM102)","v":0},{"$f":"INDEX(Tiere!G$6:G$81,$AM102)","v":0},{"$f":"INDEX(Tiere!H$6:H$81,$AM102)","v":0},{"$f":"INDEX(Tiere!I$6:I$81,$AM102)","v":0},{"$f":"INDEX(Tiere!J$6:J$81,$AM102)","v":0},{"$f":"INDEX(Tiere!K$6:K$81,$AM102)","v":0},{"$f":"IF(AU102>$AA$21,1,0)","v":{"$error":"#DIV/0!"}},{"$f":"IF(AV102>$AB$21,1,0)","v":{"$error":"#DIV/0!"}},{"$f":"SUM(AW102:AY102)","v":{"$error":"#DIV/0!"}},null,{"$f":"INDEX(Tiere!L$6:L$81,$AM102)","v":0},{"$f":"INDEX(Tiere!M$6:M$81,$AM102)","v":0},{"$f":"INDEX(Tiere!N$6:N$81,$AM102)","v":0},{"$f":"IF(BB102>$AA$21,10,0)","v":{"$error":"#DIV/0!"}},{"$f":"IF(BC102>$AB$21,10,0)","v":{"$error":"#DIV/0!"}},{"$f":"+BF102+BE102+BD102","v":{"$error":"#DIV/0!"}}]
[null,null,null,null,null,null,null,null,null,null,null,null,null,null,null,null,null,null,null,null,null,null,null,null,null,null,0,0,0,0,0,0,0,0,0,null,null,null,1,{"$f":"INDEX(Tiere!A$6:A$81,$AM103)","v":0},{"$f":"INDEX(Tiere!C$6:C$81,$AM103)","v":0},{"$f":"INDEX(Tiere!D$6:D$81,$AM103)","v":0},{"$f":"INDEX(Tiere!E$6:E$81,$AM103)","v":0},{"$f":"INDEX(Tiere!F$6:F$81,$AM103)","v":0},{"$f":"INDEX(Tiere!G$6:G$81,$AM103)","v":0},{"$f":"INDEX(Tiere!H$6:H$81,$AM103)","v":0},{"$f":"INDEX(Tiere!I$6:I$81,$AM103)","v":0},{"$f":"INDEX(Tiere!J$6:J$81,$AM103)","v":0},{"$f":"INDEX(Tiere!K$6:K$81,$AM103)","v":0},{"$error":"#DIV/0!"},{"$error":"#DIV/0!"},{"$error":"#DIV/0!"},null,{"$f":"INDEX(Tiere!L$6:L$81,$AM103)","v":0},{"$f":"INDEX(Tiere!M$6:M$81,$AM103)","v":0},{"$f":"INDEX(Tiere!N$6:N$81,$AM103)","v":0},{"$error":"#DIV/0!"},{"$error":"#DIV/0!"},{"$error":"#DIV/0!"}]
[null,null,null,null,null,null,null,null,null,null,null,null,null,null,null,null,null,null,null,null,null,null,null,null,null,null,0,0,0,0,0,0,0,0,0,null,null,null,1,{"$f":"INDEX(Tiere!A$6:A$81,$AM104)","v":0},{"$f":"INDEX(Tiere!C$6:C$81,$AM104)","v":0},{"$f":"INDEX(Tiere!D$6:D$81,$AM104)","v":0},{"$f":"INDEX(Tiere!E$6:E$81,$AM104)","v":0},{"$f":"INDEX(Tiere!F$6:F$81,$AM104)","v":0},{"$f":"INDEX(Tiere!G$6:G$81,$AM104)","v":0},{"$f":"INDEX(Tiere!H$6:H$81,$AM104)","v":0},{"$f":"INDEX(Tiere!I$6:I$81,$AM104)","v":0},{"$f":"INDEX(Tiere!J$6:J$81,$AM104)","v":0},{"$f":"INDEX(Tiere!K$6:K$81,$AM104)","v":0},{"$error":"#DIV/0!"},{"$error":"#DIV/0!"},{"$error":"#DIV/0!"},null,{"$f":"INDEX(Tiere!L$6:L$81,$AM104)","v":0},{"$f":"INDEX(Tiere!M$6:M$81,$AM104)","v":0},{"$f":"INDEX(Tiere!N$6:N$81,$AM104)","v":0},{"$error":"#DIV/0!"},{"$error":"#DIV/0!"},{"$error":"#DIV/0!"}]
[null,null,null,null,null,null,null,null,null,null,null,null,null,null,null,null,null,null,null,null,null,null,null,null,null,null,0,0,0,0,0,0,0,0,0,null,null,null,1,{"$f":"INDEX(Tiere!A$6:A$81,$AM105)","v":0},{"$f":"INDEX(Tiere!C$6:C$81,$AM105)","v":0},{"$f":"INDEX(Tiere!D$6:D$81,$AM105)","v":0},{"$f":"INDEX(Tiere!E$6:E$81,$AM105)","v":0},{"$f":"INDEX(Tiere!F$6:F$81,$AM105)","v":0},{"$f":"INDEX(Tiere!G$6:G$81,$AM105)","v":0},{"$f":"INDEX(Tiere!H$6:H$81,$AM105)","v":0},{"$f":"INDEX(Tiere!I$6:I$81,$AM105)","v":0},{"$f":"INDEX(Tiere!J$6:J$81,$AM105)","v":0},{"$f":"INDEX(Tiere!K$6:K$81,$AM105)","v":0},{"$error":"#DIV/0!"},{"$error":"#DIV/0!"},{"$error":"#DIV/0!"},null,{"$f":"INDEX(Tiere!L$6:L$81,$AM105)","v":0},{"$f":"INDEX(Tiere!M$6:M$81,$AM105)","v":0},{"$f":"INDEX(Tiere!N$6:N$81,$AM105)","v":0},{"$error":"#DIV/0!"},{"$error":"#DIV/0!"},{"$error":"#DIV/0!"}]
[null,null,null,null,null,null,null,null,null,null,null,null,null,null,null,null,null,null,null,null,null,null,null,null,null,null,0,0,0,0,0,0,0,0,0,null,null,null,1,{"$f":"INDEX(Tiere!A$6:A$81,$AM106)","v":0},{"$f":"INDEX(Tiere!C$6:C$81,$AM106)","v":0},{"$f":"INDEX(Tiere!D$6:D$81,$AM106)","v":0},{"$f":"INDEX(Tiere!E$6:E$81,$AM106)","v":0},{"$f":"INDEX(Tiere!F$6:F$81,$AM106)","v":0},{"$f":"INDEX(Tiere!G$6:G$81,$AM106)","v":0},{"$f":"INDEX(Tiere!H$6:H$81,$AM106)","v":0},{"$f":"INDEX(Tiere!I$6:I$81,$AM106)","v":0},{"$f":"INDEX(Tiere!J$6:J$81,$AM106)","v":0},{"$f":"INDEX(Tiere!K$6:K$81,$AM106)","v":0},{"$error":"#DIV/0!"},{"$error":"#DIV/0!"},{"$error":"#DIV/0!"},null,{"$f":"INDEX(Tiere!L$6:L$81,$AM106)","v":0},{"$f":"INDEX(Tiere!M$6:M$81,$AM106)","v":0},{"$f":"INDEX(Tiere!N$6:N$81,$AM106)","v":0},{"$error":"#DIV/0!"},{"$error":"#DIV/0!"},{"$error":"#DIV/0!"}]
[null,null,null,null,null,null,null,null,null,null,null,null,null,null,null,null,null,null,null,null,null,null,null,null,null,null,0,0,0,0,0,0,0,0,0,null,null,null,1,{"$f":"INDEX(Tiere!A$6:A$81,$AM107)","v":0},{"$f":"INDEX(Tiere!C$6:C$81,$AM107)","v":0},{"$f":"INDEX(Tiere!D$6:D$81,$AM107)","v":0},{"$f":"INDEX(Tiere!E$6:E$81,$AM107)","v":0},{"$f":"INDEX(Tiere!F$6:F$81,$AM107)","v":0},{"$f":"INDEX(Tiere!G$6:G$81,$AM107)","v":0},{"$f":"INDEX(Tiere!H$6:H$81,$AM107)","v":0},{"$f":"INDEX(Tiere!I$6:I$81,$AM107)","v":0},{"$f":"INDEX(Tiere!J$6:J$81,$AM107)","v":0},{"$f":"INDEX(Tiere!K$6:K$81,$AM107)","v":0},{"$error":"#DIV/0!"},{"$error":"#DIV/0!"},{"$error":"#DIV/0!"},null,{"$f":"INDEX(Tiere!L$6:L$81,$AM107)","v":0},{"$f":"INDEX(Tiere!M$6:M$81,$AM107)","v":0},{"$f":"INDEX(Tiere!N$6:N$81,$AM107)","v":0},{"$error":"#DIV/0!"},{"$error":"#DIV/0!"},{"$error":"#DIV/0!"}]
[null,null,null,null,null,null,null,null,null,null,null,null,null,null,null,null,null,null,null,null,null,null,null,null,null,null,{"$f":"SUM(AA101:AA107)","v":0},{"$f":"SUM(AB101:AB107)","v":0},0,0,0,0,0,0,0,"Summe Betrieb"]
[]
["Zukauf Futtermittel "]
["Hauptfrüchte, die in der oberen Masek nicht eingegeben werden können, bitte hier eingeben.",null,null,null,null,null,null,null,null,null,null,null,null,null,null,null,null,null,null,null,null,null,null,null,null,null,"Summe Betrieb"]
[null,null,null,null,null,null,null,null,"Zukauf",null,"Trockensub.",null,"Rohprotein",null,null,"Nährstoffgehalt kg/dt in FM",null,null,null,null,null,null,null,null,null,"Futter ","Futter ",null,null,"kg/dt"]
["Zukauf Futtermittel",null,null,null,null,null,null,null,"Menge",null,"TS*","TS","Rohpr.*","Rohpr.","Rohpr.","oder % in der FM",null,null,null,null,null,null,null,null,null,"Menge","Menge",null,"FM","FM","FM"]
[null,null,null,null,null,null,null,null,"dt FM",null,"% in der FM",null,"% TM","% TM","% FM","N",null,"P",null,"P2O5 ",null,null,null,null,null,"dt TM","dt FM","TS","Rp","N","P2O5"]
[null,null,null,null,null,null,null,null,null,null,null,{"$f":"IF($AM115=1,\" \",IF(K115>0,K115,AR115))","v":" "},null,{"$f":"IF($AM115=1,\" \",IF(M115>0,M115,AO115))","v":" "},{"$f":"IF($AM115=1,\" \",N115*L115/100)","v":" "},{"$f":"IF(N115=0,0,IF($AM115=1,\" \",(AP115/AR115*L115)/AO115*N115))","v":" "},null,{"$f":"IF($AM115=1,\" \",T115/2.291)","v":" "},null,{"$f":"IF($AM115=1,\" \",(AQ115/AR115*L115))","v":" "},null,null,null,null,null,{"$f":"+AA115*AB115/100","v":0},{"$f":"+IF(I115=\"\",0,I115)","v":0},{"$f":"IF(AA115=0,0,L115)","v":0},{"$f":"IF(AA115=0,0,O115)","v":0},{"$f":"IF(AA115=0,0,AA115*P115)","v":0},{"$f":"IF(AA115=0,0,AA115*T115)","v":0},null,null,null,null,null,null,null,1,{"$f":"INDEX(Futtermittel!A$6:A$177,$AM115)","v":0},{"$f":"INDEX(Futtermittel!B$6:B$177,$AM115)","v":0},{"$f":"INDEX(Futtermittel!C$6:C$177,$AM115)","v":0},{"$f":"INDEX(Futtermittel!D$6:D$177,$AM115)","v":0},{"$f":"INDEX(Futtermittel!E$6:E$177,$AM115)","v":0},{"$f":"INDEX(Futtermittel!F$6:F$177,$AM115)","v":0}]
[null,null,null,null,null,null,null,null,null,null,null,{"$f":"IF($AM116=1,\" \",IF(K116>0,K116,AR116))","v":" "},null,{"$f":"IF($AM116=1,\" \",IF(M116>0,M116,AO116))","v":" "},{"$f":"IF($AM116=1,\" \",N116*L116/100)","v":" "}," ",null," ",null," ",null,null,null,null,null,0,{"$f":"+IF(I116=\"\",0,I116)","v":0},{"$f":"IF(AA116=0,0,L116)","v":0},{"$f":"IF(AA116=0,0,O116)","v":0},{"$f":"IF(AA116=0,0,AA116*P116)","v":0},{"$f":"IF(AA116=0,0,AA116*T116)","v":0},null,null,null,null,null,null,null,1,{"$f":"INDEX(Futtermittel!A$6:A$177,$AM116)","v":0},{"$f":"INDEX(Futtermittel!B$6:B$177,$AM116)","v":0},{"$f":"INDEX(Futtermittel!C$6:C$177,$AM116)","v":0},{"$f":"INDEX(Futtermittel!D$6:D$177,$AM116)","v":0},{"$f":"INDEX(Futtermittel!E$6:E$177,$AM116)","v":0},{"$f":"INDEX(Futtermittel!F$6:F$177,$AM116)","v":0}]
[null,null,null,null,null,null,null,null,null,null,null," ",null," "," "," ",null," ",null," ",null,null,null,null,null,0,0,0,0,0,0,null,null,null,null,null,null,null,1,{"$f":"INDEX(Futtermittel!A$6:A$177,$AM117)","v":0},{"$f":"INDEX(Futtermittel!B$6:B$177,$AM117)","v":0},{"$f":"INDEX(Futtermittel!C$6:C$177,$AM117)","v":0},{"$f":"INDEX(Futtermittel!D$6:D$177,$AM117)","v":0},{"$f":"INDEX(Futtermittel!E$6:E$177,$AM117)","v":0},{"$f":"INDEX(Futtermittel!F$6:F$177,$AM117)","v":0}]
[null,null,null,null,null,null,null,null,null,null,null," ",null," "," "," ",null," ",null," ",null,null,null,null,null,0,0,0,0,0,0,null,null,null,null,null,null,null,1,{"$f":"INDEX(Futtermittel!A$6:A$177,$AM118)","v":0},{"$f":"INDEX(Futtermittel!B$6:B$177,$AM118)","v":0},{"$f":"INDEX(Futtermittel!C$6:C$177,$AM118)","v":0},{"$f":"INDEX(Futtermittel!D$6:D$177,$AM118)","v":0},{"$f":"INDEX(Futtermittel!E$6:E$177,$AM118)","v":0},{"$f":"INDEX(Futtermittel!F$6:F$177,$AM118)","v":0}]
[null,null,null,null,null,null,null,null,null,null,null," ",null," "," "," ",null," ",null," ",null,null,null,null,null,0,0,0,0,0,0,null,null,null,null,null,null,null,1,{"$f":"INDEX(Futtermittel!A$6:A$177,$AM119)","v":0},{"$f":"INDEX(Futtermittel!B$6:B$177,$AM119)","v":0},{"$f":"INDEX(Futtermittel!C$6:C$177,$AM119)","v":0},{"$f":"INDEX(Futtermittel!D$6:D$177,$AM119)","v":0},{"$f":"INDEX(Futtermittel!E$6:E$177,$AM119)","v":0},{"$f":"INDEX(Futtermittel!F$6:F$177,$AM119)","v":0}]
[null,null,null,null,null,null,null,null,null,null,null," ",null," "," "," ",null," ",null," ",null,null,null,null,null,0,0,0,0,0,0,null,null,null,null,null,null,null,1,{"$f":"INDEX(Futtermittel!A$6:A$177,$AM120)","v":0},{"$f":"INDEX(Futtermittel!B$6:B$177,$AM120)","v":0},{"$f":"INDEX(Futtermittel!C$6:C$177,$AM120)","v":0},{"$f":"INDEX(Futtermittel!D$6:D$177,$AM120)","v":0},{"$f":"INDEX(Futtermittel!E$6:E$177,$AM120)","v":0},{"$f":"INDEX(Futtermittel!F$6:F$177,$AM120)","v":0}]
[null,null,null,null,null,null,null,null,null,null,null," ",null," "," "," ",null," ",null," ",null,null,null,null,null,0,0,0,0,0,0,null,null,null,null,null,null,null,1,{"$f":"INDEX(Futtermittel!A$6:A$177,$AM121)","v":0},{"$f":"INDEX(Futtermittel!B$6:B$177,$AM121)","v":0},{"$f":"INDEX(Futtermittel!C$6:C$177,$AM121)","v":0},{"$f":"INDEX(Futtermittel!D$6:D$177,$AM121)","v":0},{"$f":"INDEX(Futtermittel!E$6:E$177,$AM121)","v":0},{"$f":"INDEX(Futtermittel!F$6:F$177,$AM121)","v":0}]
[null,null,null,null,null,null,null,null,null,null,null," ",null," "," "," ",null," ",null," ",null,null,null,null,null,0,0,0,0,0,0,null,null,null,null,null,null,null,1,{"$f":"INDEX(Futtermittel!A$6:A$177,$AM122)","v":0},{"$f":"INDEX(Futtermittel!B$6:B$177,$AM122)","v":0},{"$f":"INDEX(Futtermittel!C$6:C$177,$AM122)","v":0},{"$f":"INDEX(Futtermittel!D$6:D$177,$AM122)","v":0},{"$f":"INDEX(Futtermittel!E$6:E$177,$AM122)","v":0},{"$f":"INDEX(Futtermittel!F$6:F$177,$AM122)","v":0}]
[null,null,null,null,null,null,null,null,null,null,null," ",null," "," "," ",null," ",null," ",null,null,null,null,null,0,0,0,0,0,0,null,null,null,null,null,null,null,1,{"$f":"INDEX(Futtermittel!A$6:A$177,$AM123)","v":0},{"$f":"INDEX(Futtermittel!B$6:B$177,$AM123)","v":0},{"$f":"INDEX(Futtermittel!C$6:C$177,$AM123)","v":0},{"$f":"INDEX(Futtermittel!D$6:D$177,$AM123)","v":0},{"$f":"INDEX(Futtermittel!E$6:E$177,$AM123)","v":0},{"$f":"INDEX(Futtermittel!F$6:F$177,$AM123)","v":0}]
[null,null,null,null,null,null,null,null,null,null,null,null,null,{"$f":"IF(O124=\"\",\" \",(O124/L124)*100)","v":" "},null,null,null,null,null,{"$f":"IF(R124=\"\",\"\",R124*2.291)","v":""},null,null,null,null,null,0,0,0,0,0,0]
[null,null,null,null,null,null,null,null,null,null,null,null,null,{"$f":"IF(O125=\"\",\" \",(O125/L125)*100)","v":" "},null,null,null,null,null,{"$f":"IF(R125=\"\",\"\",R125*2.291)","v":""},null,null,null,null,null,0,0,0,0,0,0]
[null,null,null,null,null,null,null,null,null,null,null,null,null,{"$f":"IF(O126=\"\",\" \",(O126/L126)*100)","v":" "},null,null,null,null,null,"",null,null,null,null,null,0,0,0,0,0,0]
[null,null,null,null,null,null,null,null,null,null,null,null,null," ",null,null,null,null,null,"",null,null,null,null,null,0,0,0,0,0,0]
[null,null,null,null,null,null,null,null,null,null,null,null,null," ",null,null,null,null,null,"",null,null,null,null,null,0,0,0,0,0,0]
[null,null,null,null,null,null,null,null,null,null,null,null,null," ",null,null,null,null,null,"",null,null,null,null,null,0,0,0,0,{"$f":"IF(AA129=0,0,AA129*P129)","v":0},{"$f":"IF(AA129=0,0,AA129*T129)","v":0}]
[null,null,null,null,null,null,null,null,null,null,null,null,null," ",null,null,null,null,null,"",null,null,null,null,null,0,0,0,0,0,0]
[null,null,null,null,null,null,null,null,null,null,null,null,null," ",null,null,null,null,null,"",null,null,null,null,null,0,0,0,0,0,0]
[null,null,null,null,null,null,null,null,null,null,null,null,null," ",null,null,null,null,null,"",null,null,null,null,null,0,0,0,0,0,0]
[null,null,null,null,null,null,null,null,null,null,null,null,null," ",null,null,null,null,null,{"$f":"IF(R133=\"\",\"\",R133*2.291)","v":""},null,null,null,null,null,0,{"$f":"+IF(I133=\"\",0,I133)","v":0},{"$f":"IF(AA133=0,0,L133)","v":0},{"$f":"IF(AA133=0,0,O133)","v":0},{"$f":"IF(AA133=0,0,AA133*P133)","v":0},{"$f":"IF(AA133=0,0,AA133*T133)","v":0}]
[null,null,null,null,null,null,null,null,null,null,null,null,null," ",null,null,null,null,null,"",null,null,null,null,null,0,0,0,0,0,0]
[null,null,null,null,null,null,null,null,null,null,null,null,null," ",null,null,null,null,null,"",null,null,null,null,null,0,0,0,0,0,0]
[null,null,null,null,null,null,null,null,null,null,null,null,null," ",null,null,null,null,null,"",null,null,null,null,null,0,0,0,0,0,0]
[null,null,null,null,null,null,null,null,null,null,null,null,null," ",null,null,null,null,null,"",null,null,null,null,null,0,0,0,0,0,0]
[null,null,null,null,null,null,null,null,null,null,null,null,null," ",null,null,null,null,null,"",null,null,null,null,null,0,0,0,0,0,0]
[null,null,null,null,null,null,null,null,null,null,null,null,null," ",null,null,null,null,null,"",null,null,null,null,null,0,0,0,0,0,0]
[null,null,null,null,null,null,null,null,null,null,null,null,null," ",null,null,null,null,null,"",null,null,null,null,null,0,0,0,0,0,0]
[null,null,null,null,null,null,null,null,null,null,null,null,null," ",null,null,null,null,null,"",null,null,null,null,null,0,0,0,0,0,0]
[null,null,null,null,null,null,null,null,null,null,null,null,null," ",null,null,null,null,null,"",null,null,null,null,null,0,0,0,0,0,0]
["* falls bekannt (bei keiner Angabe werden die Basisdaten verwendet)",null,null,null,null,null,null,null,null,null,null,null,null,null,null,null,null,null,null,null,null,null,null,null,null,{"$f":"SUM(Z115:Z142)","v":0},{"$f":"SUM(AA115:AA142)","v":0},{"$f":"+(AA115*AB115+AA116*AB116+AA117*AB117+AA118*AB118+AA119*AB119+AA120*AB120+AA121*AB121+AA122*AB122+AA123*AB123+AA124*AB124+AA125*AB125+AA126*AB126+AA127*AB127+AA128*AB128+AA129*AB129+AA130*AB130+AA131*AB131+AA132*AB132+AA138*AB138+AA139*AB139+AA140*AB140+AA141+AB141+AA142*AB142)/AA143","v":{"$error":"#DIV/0!"}},{"$f":"+(AA115*AC115+AA116*AC116+AA117*AC117+AA118*AC118+AA119*AC119+AA120*AC120+AA121*AC121+AA122*AC122+AA123*AC123+AA124*AC124+AA125*AC125+AA126*AC126+AA127*AC127+AA128*AC128+AA129*AC129+AA130*AC130+AA131*AC131+AA132*AC132+AA138*AC138+AA139*AC139+AA140*AC140+AA141+AC141+AA142*AC142)/AA143","v":{"$error":"#DIV/0!"}},{"$f":"SUM(AD115:AD142)","v":0},0,"Summe Betrieb"]
["© Bayerische Landesanstalt für Landwirtschaft (Of, Sp, We, Schn, Br, Ka) - Stand: 08.09.2020",null,null,null,null,null,null,null,null,null,null,null,null,null,null,null,null,null,null,null,null,null,null,null,null,null,null,null,{"$f":"+AC143/AB143*88","v":{"$error":"#DIV/0!"}},null,null,"Rp bei 88 % TS"]
[]
[]
[]
[]
[]
[null,null,null,null,null,null,null,null,null,null,null,null,null,null,null,null,null,null,null,null,null,null," "]
[]
[]
[]
[]
[]
[]
[]
[]
[]
[]
[]
[]
[]
[null,null,null,null,null,null,null,null,null,null,null,null,null,null,null,null,null,null,null,null,null,null,null,null,null,null,{"$f":"SUM(AA115:AA163)","v":0},{"$f":"+(AA115*AB115+AA116*AB116+AA117*AB117+AA118*AB118+AA119*AB119+AA120*AB120+AA121*AB121+AA122*AB122+AA123*AB123+AA124*AB124+AA125*AB125+AA126*AB126+AA127*AB127+AA128*AB128)/AA164","v":{"$error":"#DIV/0!"}},{"$f":"+(AA115*AC115+AA116*AC116+AA117*AC117+AA118*AC118+AA119*AC119+AA120*AC120+AA121*AC121+AA122*AC122+AA123*AC123+AA124*AC124+AA125*AC125+AA126*AC126+AA127*AC127+AA128*AC128)/AA164","v":{"$error":"#DIV/0!"}},{"$f":"SUM(AD115:AD163)","v":0},{"$f":"SUM(AE115:AE163)","v":0},"Summe Betrieb"]
[]
[]
[]
[]
[]
[]
[]
[]
[]
[]
[]
[]
[]
[]
[]
[]
[]
[]
[]
[]
[]
[]
[]
[]
[]
[]
[null,null,null,null,null,null,null,null,null,null,null,null,null,null,null,null,null,null,null,null,null,null,null,null,null,null,null,null,null,null,null,null,null,null,null,null,null,null,null,null,null,{"$error":"#DIV/0!"},0]
[null,null,null,null,null,null,null,null,null,null,null,null,null,null,null,null,null,null,null,null,null,null,null,null,null,null,null,null,null,null,null,null,null,null,null,null,null,null,null,null,null,{"$error":"#DIV/0!"},0]
[null,null,null,null,null,null,null,null,null,null,null,null,null,null,null,null,null,null,null,null,null,null,null,null,null,null,null,null,null,null,null,null,null,null,null,null,null,null,null,null,null,{"$error":"#DIV/0!"},0]
[null,null,null,null,null,null,null,null,null,null,null,null,null,null,null,null,null,null,null,null,null,null,null,null,null,null,null,null,null,null,null,null,null,null,null,null,null,null,null,null,null,{"$error":"#DIV/0!"},0]
[null,null,null,null,null,null,null,null,null,null,null,null,null,null,null,null,null,null,null,null,null,null,null,null,null,null,null,null,null,null,null,null,null,null,null,null,null,null,null,null,null,{"$error":"#DIV/0!"},0]
[null,null,null,null,null,null,null,null,null,null,null,null,null,null,null,null,null,null,null,null,null,null,null,null,null,null,null,null,null,null,null,null,null,null,null,null,null,null,null,null,null,{"$error":"#DIV/0!"},0]
[null,null,null,null,null,null,null,null,null,null,null,null,null,null,null,null,null,null,null,null,null,null,null,null,null,null,null,null,null,null,null,null,null,null,null,null,null,null,null,null,null,{"$error":"#DIV/0!"},0]
[null,null,null,null,null,null,null,null,null,null,null,null,null,null,null,null,null,null,null,null,null,null,null,null,null,null,null,null,null,null,null,null,null,null,null,null,null,null,null,null,null,{"$error":"#DIV/0!"},0]
[null,null,null,null,null,null,null,null,null,null,null,null,null,null,null,null,null,null,null,null,null,null,null,null,null,null,null,null,null,null,null,null,null,null,null,null,null,null,null,null,null,{"$error":"#DIV/0!"},0]
[null,null,null,null,null,null,null,null,null,null,null,null,null,null,null,null,null,null,null,null,null,null,null,null,null,null,null,null,null,null,null,null,null,null,null,null,null,null,null,null,null,{"$error":"#DIV/0!"},0]
[null,null,null,null,null,null,null,null,null,null,null,null,null,null,null,null,null,null,null,null,null,null,null,null,null,null,null,null,null,null,null,null,null,null,null,null,null,null,null,null,null,"für Grafik"]
[]
[]
[]
[]
[]
[]
[]
[]
[]
[]
[]
[]
[]
[]
[]
[]
[]
[]
[]
[]
[]
[]
[]
[]
[]
[]
[]
[]
[null,null,null,null,null,null,null,null,null,null,null,null,null,null,null,null,null,null,null,null,null,null,null,null,null,null,null,null,null,null,null,null,null,null,null,null,null,null,null,null,null,{"$error":"#DIV/0!"},0]

{"sheet":"Tiere","index":1,"n_rows":39,"n_cols":14,"rows_kept":39,"cut":false,"hidden":true,"merged":[]}
[null,null,"Nährstoffauscheidung",null,null,"Nährstoffabfuhr je dt Lebendgewicht"]
[null,null,"N","P2O5","K2O","N","P2O5","K2O","N","P2O5"]
[null,null,null,null,null,null,null,null,"% über stark np möglich",null,null,"% geringer bei stark np"]
[]
[]
[]
["Zuchtsauen (ab Belegen) mit 22 Ferkel bis 8 kg, N-/P-red. ",null,24,11,11.568,2.56,1.17,0.24,null,null,null,{"$f":"+C8/C7","v":0.95833333333333337},{"$f":"+D8/D7","v":0.9363636363636364},10]
["Zuchtsauen (ab Belegen) mit 22 Ferkel bis 8 kg, stark N-/P-red.",null,23,10.3,11.568,2.56,1.17,0.24,{"$f":"+C7/C8","v":1.0434782608695652},{"$f":"+D7/D8","v":1.0679611650485437},1]
["Zuchtsauen (ab Belegen) mit 25 Ferkel bis 8 kg, N-/P-red. ",null,24.1,11.2,11.58005,2.56,1.17,0.24,null,null,null,{"$f":"+C10/C9","v":0.95850622406639008},{"$f":"+D10/D9","v":0.91964285714285732},10]
["Zuchtsauen (ab Belegen) mit 25 Ferkel bis 8 kg, stark N-/P-red. ",null,23.1,10.3,11.58005,2.56,1.17,0.24,{"$f":"+C9/C10","v":1.0432900432900434},{"$f":"+D9/D10","v":1.087378640776699},1]
["Zuchtsauen (ab Belegen) mit 28 Ferkel bis 8 kg, N-/P-red. ",null,24.2,11.2,11.821050000000001,2.56,1.17,0.24,null,null,null,{"$f":"+C12/C11","v":0.95867768595041325},{"$f":"+D12/D11","v":0.91964285714285732},10]
["Zuchtsauen (ab Belegen) mit 28 Ferkel bis 8 kg, stark N-/P-red. ",null,23.2,10.3,11.821050000000001,2.56,1.17,0.24,{"$f":"+C11/C12","v":1.0431034482758621},{"$f":"+D11/D12","v":1.087378640776699},1]
["Zuchtsauen (ab Belegen) mit 22 Ferkel bis 28 kg, N-/P-red.",null,35.1,15.3,18.315999999999999,2.56,1.17,0.24,null,null,null,{"$f":"+C14/C13","v":0.95441595441595439},{"$f":"+D14/D13","v":0.91503267973856206},10]
["Zuchtsauen (ab Belegen) mit 22 Ferkel bis 28 kg, stark N-/P-red.",null,33.5,14,18.315999999999999,2.56,1.17,0.24,{"$f":"+C13/C14","v":1.0477611940298508},{"$f":"+D13/D14","v":1.092857142857143},1]
["Zuchtsauen (ab Belegen) mit 25 Ferkel bis 28 kg, N-/P-red.",null,36.799999999999997,16,19.521000000000001,2.56,1.17,0.24,null,null,null,{"$f":"+C16/C15","v":0.95108695652173925},{"$f":"+D16/D15","v":0.91874999999999996},10]
["Zuchtsauen (ab Belegen) mit 25 Ferkel bis 28 kg, stark N-/P-red.",null,35,14.7,19.521000000000001,2.56,1.17,0.24,{"$f":"+C15/C16","v":1.0514285714285714},{"$f":"+D15/D16","v":1.08843537414966},1]
["Zuchtsauen (ab Belegen) mit 28 Ferkel bis 28 kg, N-/P-red.",null,38.4,16.7,20.725999999999999,2.56,1.17,0.24,null,null,null,{"$f":"+C18/C17","v":0.95312500000000011},{"$f":"+D18/D17","v":0.9041916167664672},10]
["Zuchtsauen (ab Belegen) mit 28 Ferkel bis 28 kg, stark N-/P-red.",null,36.6,15.100000000000001,20.725999999999999,2.56,1.17,0.24,{"$f":"+C17/C18","v":1.0491803278688523},{"$f":"+D17/D18","v":1.1059602649006621},1]
["Ferkel von 8 bis 28 kg, 450 g TZ, N-/P-red.",null,4.1898713826366558,1.6132765273311893,2.6021800643086817,2.56,1.17,0.24,null,null,null,{"$f":"+C20/C19","v":0.94117647058823528},{"$f":"+D20/D19","v":0.83333333333333348},10]
["Ferkel von 8 bis 28 kg, 450 g TZ, stark N-/P-red.",null,3.943408360128617,1.3443971061093247,2.6021800643086817,2.56,1.17,0.24,{"$f":"+C19/C20","v":1.0625},{"$f":"+D19/D20","v":1.1999999999999997},1]
["Ferkel von 8 bis 28 kg, 500 g TZ, N-/P-red.",null,4.38,1.5968749999999998,2.803884375,2.56,1.17,0.24,null,null,null,{"$f":"+C22/C21","v":0.93750000000000011},{"$f":"+D22/D21","v":1},10]
["Ferkel von 8 bis 28 kg, 500 g TZ, stark N-/P-red.",null,4.1062500000000002,1.5968749999999998,2.803884375,2.56,1.17,0.24,{"$f":"+C21/C22","v":1.0666666666666667},{"$f":"+D21/D22","v":1},1]
["Jungsauenaufzucht, 28-95 kg, N-/P-red. ",null,9.8063333333333329,5.1287853333333331,5.0433266666666663,2.56,1.17,0.24]
["Jungsaueneingliederung, 95-135 kg, N-/P-red.",null,14.153061224489797,7.9964583090378998,6.8858899416909622,2.56,1.17,0.24]
["Mastschweine (700 g TZ), N-/P-red.",null,13.018333333333333,4.9894161666666665,6.4800883333333337,2.56,1.17,0.24,null,null,null,{"$f":"+C26/C25","v":0.89719626168224298},{"$f":"+D26/D25","v":0.92178770949720668},10]
["Mastschweine (700 g TZ), stark N-/P-red.",null,11.68,4.5991824999999995,6.3041583333333326,2.56,1.17,0.24,{"$f":"+C25/C26","v":1.1145833333333333},{"$f":"+D25/D26","v":1.084848484848485},1]
["Mastschweine (750 g TZ), N-/P-red.",null,13.440878378378377,5.1415922297297296,6.7756824324324327,2.56,1.17,0.24,null,null,null,{"$f":"+C28/C27","v":0.8990825688073395},{"$f":"+D28/D27","v":0.91758241758241743},10]
["Mastschweine (750 g TZ), stark N-/P-red.",null,12.08445945945946,4.7178346283783776,6.5676570945945949,2.56,1.17,0.24,{"$f":"+C27/C28","v":1.1122448979591835},{"$f":"+D27/D28","v":1.0898203592814373},1]
["Mastschweine (850 g TZ), N-/P-red.",null,14.776816608996539,5.4108029411764713,7.2746141868512124,2.56,1.17,0.24,null,null,null,{"$f":"+C30/C29","v":0.90598290598290609},{"$f":"+D30/D29","v":0.91443850267379678},10]
["Mastschweine (850 g TZ), stark N-/P-red.",null,13.387543252595156,4.9478465397923879,7.0615501730103807,2.56,1.17,0.24,{"$f":"+C29/C30","v":1.1037735849056602},{"$f":"+D29/D30","v":1.0935672514619883},1]
["Mastschweine (950 g TZ), N-/P-red.",null,15.587188612099645,5.6243642348754443,7.7791112099644124,2.56,1.17,0.24,null,null,null,{"$f":"+C32/C31","v":0.90000000000000013},{"$f":"+D32/D31","v":0.91534391534391535},10]
["Mastschweine (950 g TZ), stark N-/P-red.",null,14.028469750889682,5.1482275800711736,7.5443291814946631,2.56,1.17,0.24,{"$f":"+C31/C32","v":1.1111111111111109},{"$f":"+D31/D32","v":1.0924855491329479},1]
["Jungebermast, 850 g TZ (w:m=1:1), N-/P-red.",null,14.271626297577855,5.4976072664359856,8.1116513840830464,2.56,1.17,0.24,null,null,null,{"$f":"+C34/C33","v":0.95575221238938057},{"$f":"+D34/D33","v":0.90000000000000013},10]
["Jungebermast, 850 g TZ (w:m=1:1), stark N-/P-red.",null,13.6401384083045,4.9478465397923879,7.7311799307958484,2.56,1.17,0.24,{"$f":"+C33/C34","v":1.0462962962962963},{"$f":"+D33/D34","v":1.1111111111111109},1]
["Jungebermast, 900 g TZ (Eber=100%), N-/P-red.",null,13.959649122807019,5.3106987719298244,8.1792017543859643,2.56,1.17,0.24,null,null,null,{"$f":"+C36/C35","v":0.94495412844036697},{"$f":"+D36/D35","v":0.88950276243093929},10]
["Jungebermast, 900 g TZ (Eber=100%), stark N-/P-red.",null,13.191228070175439,4.7238812280701756,7.7162280701754389,2.56,1.17,0.24,{"$f":"+C35/C36","v":1.058252427184466},{"$f":"+D35/D36","v":1.1242236024844721},1]
["Weibliche, 800 g TZ (Weibliche 100 %), N-/P-red.",null,14.624999999999998,5.6129499999999997,7.8776875000000013,2.56,1.17,0.24,null,null,null,{"$f":"+C38/C37","v":0.95726495726495731},{"$f":"+D38/D37","v":0.90816326530612257},10]
["Weibliche, 800 g TZ (Weibliche 100 %), stark N-/P-red.",null,13.999999999999998,5.0974750000000002,7.5613750000000008,2.56,1.17,0.24,{"$f":"+C37/C38","v":1.0446428571428572},{"$f":"+D37/D38","v":1.1011235955056178},1]
["Zuchteber",null,22.1,9.6221999999999994,8.7965,2.56,1.17,0.24]

{"sheet":"Futtermittel","index":2,"n_rows":484,"n_cols":8,"rows_kept":484,"cut":false,"hidden":true,"merged":[]}
[]
[]
[]
[null,"RP TM","N","P2O5","TS","Rp FM"]
["Futtermittel",null,"FM","FM"]
[]
[" +++Getreide+++ "]
["Winterweizen C-Sorte",12,1.81,0.8,86,{"$f":"+C8*5.7","v":10.317},{"$f":"+F8/E8*100","v":11.996511627906976},{"$f":"+B8-G8","v":3.4883720930238837E-3}]
["Winterweizen A/B-Sorte",14,2.11,0.8,86,{"$f":"+C9*5.7","v":12.026999999999999},{"$f":"+F9/E9*100","v":13.984883720930233},{"$f":"+B9-G9","v":1.5116279069767202E-2}]
["Winterweizen E-Sorte",16,2.41,0.8,86,13.737000000000002,15.973255813953491,2.6744186046508744E-2]
["Winterbrauweizen",12,1.81,0.75,86,10.317,11.996511627906976,3.4883720930238837E-3]
["Sommerweizen",14,2.11,0.75,86,12.026999999999999,13.984883720930233,1.5116279069767202E-2]
["Weizenstroh",{"$f":"+F13/E13*100","v":3.6337209302325584},0.5,0.3,86,{"$f":"+C13*6.25","v":3.125},3.6337209302325584,0]
["Wintergerste ",12,1.65,0.8,86,10.3125,11.991279069767442,8.720930232557933E-3]
["Winterbraugerste",11,1.51,0.8,86,9.4375,10.973837209302326,2.6162790697673799E-2]
["Sommerfuttergerste",12,1.65,0.8,86,10.3125,11.991279069767442,8.720930232557933E-3]
["Sommerbraugerste",10,1.38,0.8,86,8.625,10.029069767441861,-2.9069767441860961E-2]
["Gerstenstroh",{"$f":"+F18/E18*100","v":3.6337209302325584},0.5,0.3,86,3.125,3.6337209302325584,0]
["Winterroggen",11,1.51,0.8,86,9.4375,10.973837209302326,2.6162790697673799E-2]
["Sommerroggen",11,1.51,0.8,86,9.4375,10.973837209302326,2.6162790697673799E-2]
["Roggenstroh",{"$f":"+F21/E21*100","v":3.6337209302325584},0.5,0.3,86,3.125,3.6337209302325584,0]
["Hafer",11,1.51,0.8,86,9.4375,10.973837209302326,2.6162790697673799E-2]
["Haferstroh",{"$f":"+F23/E23*100","v":3.6337209302325584},0.5,0.3,86,3.125,3.6337209302325584,0]
["Triticale",12,1.65,0.8,86,10.3125,11.991279069767442,8.720930232557933E-3]
["Dinkel",12,1.65,0.8,86,10.3125,11.991279069767442,8.720930232557933E-3]
["Emmer/Einkorn",12,1.81,0.75,86,{"$f":"+C26*5.7","v":10.317},11.996511627906976,3.4883720930238837E-3]
["Hartweizen (Durum)",12,1.81,0.8,86,{"$f":"+C27*5.7","v":10.317},11.996511627906976,3.4883720930238837E-3]
["Buchweizen",16.933139534883722,2.33,0.65,86,14.5625,16.933139534883722,0]
[" ++++Körnermais, sonstige Körnernutzung+++ "]
["Körnermais ",10,1.38,0.8,86,8.625,10.029069767441861,-2.9069767441860961E-2]
["Körnermaisstroh",{"$f":"+F31/E31*100","v":6.5406976744186052},0.9,0.2,86,5.625,6.5406976744186052,0]
["Hirse",17.005813953488371,2.34,0.89,86,14.625,17.005813953488371,0]
["Amarant",17.005813953488371,2.34,0.89,86,14.625,17.005813953488371,0]
["Quinoa",16.279069767441865,2.2400000000000002,0.94,86,14.000000000000002,16.279069767441861,0]
[" +++Körnerleguminosen+++"]
["Ackerbohnen",29.8,4.0999999999999996,1.2,86,25.624999999999996,29.796511627906973,3.4883720930274364E-3]
["Erbsen",26,3.6,1.1000000000000001,86,22.5,26.162790697674421,-0.16279069767442067]
["Wicken",26,3.6,1.1000000000000001,86,22.5,26.162790697674421,-0.16279069767442067]
["Lupinen blau",33,4.4800000000000004,1.02,86,28.000000000000004,32.558139534883722,0.44186046511627808]
["Linsen",26,3.5775999999999999,1.1000000000000001,86,22.36,26,0]
["Sojabohnen",32,4.4000000000000004,1.5,86,27.500000000000004,31.976744186046517,2.3255813953483084E-2]
[" +++Ölfrüchte und Faserpflanzen+++"]
["Raps",23,3.35,1.8,91,20.9375,23.008241758241756,-8.2417582417555479E-3]
["Rübsen",23,3.35,1.8,91,20.9375,23.008241758241756,-8.2417582417555479E-3]
["Sonnenblumen ",20,2.91,1.6,91,18.1875,19.986263736263737,1.3736263736262799E-2]
["Körnersenf",35,5.08,1.77,91,31.75,34.890109890109891,0.1098901098901095]
["Öllein, Faserflachs ",24,3.5,1.2,91,21.875,24.03846153846154,-3.8461538461540101E-2]
["Leindotter",24,3.5,1.2,91,21.875,24.03846153846154,-3.8461538461540101E-2]
["Flachs (Faserlein)",{"$f":"+F49/E49*100","v":7.2674418604651168},1,0.64,86,6.25,7.2674418604651168,0]
["Hanf",{"$f":"+F50/E50*100","v":6.25},0.4,0.3,40,2.5,6.25,0]
[" +++Hackfrüchte+++"]
["Kartoffel ",{"$f":"+F52/E52*100","v":9.9431818181818183},0.35,0.14000000000000001,22,2.1875,9.9431818181818183,0]
["Zuckerrüben",{"$f":"+F53/E53*100","v":4.8913043478260869},0.18,0.1,23,1.125,4.8913043478260869,0]
["Zuckerrübenblatt",{"$f":"+F54/E54*100","v":13.888888888888889},0.4,0.11,18,2.5,13.888888888888889,0]
["Futter-, Runkelrüben",{"$f":"+F55/E55*100","v":7.5},0.18,0.09,15,1.125,7.5,0]
["Kohl-, Steckrüben",{"$f":"+F56/E56*100","v":7.291666666666667},0.14000000000000001,7.0000000000000007E-2,12,0.87500000000000011,7.291666666666667,0]
[" +++Futterpflanzen+++"]
["Silomais (28 % TM)",{"$f":"+F58/E58*100","v":8.4821428571428577},0.38,0.16,28,2.375,8.4821428571428577,0]
["Silomais (32 % TM)",{"$f":"+F59/E59*100","v":8.3984375},0.43,0.17,32,2.6875,8.3984375,0]
["Silomais (35 % TM)",{"$f":"+F60/E60*100","v":8.3984375},0.47031249999999997,0.18,35,2.939453125,8.3984375,0]
["CCM",10.5,1.0080000000000002,0.40799999999999997,60,{"$f":"+C61*6.25","v":6.3000000000000016},10.500000000000002,0]
["Lieschkolbensilage",{"$f":"+F62/E62*100","v":9.5},0.76,0.32,50,4.75,9.5,0]
["GPS Getreide",10,0.56000000000000005,0.23099999999999996,35,3.5000000000000004,10.000000000000002,0]
["GPS Lupinen",{"$f":"+F64/E64*100","v":10.000000000000002},0.56000000000000005,0.23,35,3.5000000000000004,10.000000000000002,0]
["GPS Erbsen/Ackerbohne",{"$f":"+F65/E65*100","v":10.000000000000002},0.56000000000000005,0.23,35,3.5000000000000004,10.000000000000002,0]
["GPS Sonnenblumen",8.4,0.46900000000000003,0.19599999999999998,35,2.9312500000000004,8.375,2.5000000000000355E-2]
["GPS Rübsen ",{"$f":"+F67/E67*100","v":10.000000000000002},0.56000000000000005,0.23,35,3.5000000000000004,10.000000000000002,0]
["GPS Wicken",{"$f":"+F68/E68*100","v":10.000000000000002},0.56000000000000005,0.23,35,3.5000000000000004,10.000000000000002,0]
["GPS Raps ",{"$f":"+F69/E69*100","v":10.000000000000002},0.56000000000000005,0.23,35,3.5000000000000004,10.000000000000002,0]
[" +++Milch+++"]
["Kuhmilch (3,2 % Eiweiß)",24.351145038167939,0.5,0.23,13.1,{"$f":"+C71*6.25","v":3.125},23.854961832061068,0.4961832061068705]
["Kuhmilch (3,4 % Eiweiß)",25.42406015037594,0.53,0.23,13.3,3.3125,24.906015037593985,0.5180451127819552]
["Kuhmilch (3,6 % Eiweiß)",26.465185185185188,0.56000000000000005,0.23,13.5,3.5000000000000004,{"$f":"+F73/E73*100","v":25.925925925925931},{"$f":"+B73-G73","v":0.53925925925925711}]
["Stutenmilch (2,2 % Eiweiß)",21.679611650485434,0.35,0.14000000000000001,10.3,2.1875,21.237864077669901,0.44174757281553312]
["Ziegenmilch (3,7 % Eiweiß)",29.137007874015747,0.57999999999999996,0.28000000000000003,12.7,3.6249999999999996,28.543307086614174,0.59370078740157339]
["Schafmilch (5,3 % Eiweiß)",31.333727810650892,0.83,0.25,16.899999999999999,5.1875,30.695266272189354,0.63846153846153797]
[" +++Futtermittel nach Anlage 1, Tab.4  der StoffBilV+++"]
["Altbrot",15,1.56,0.19500000000000001,65,9.75,15,0]
["Apfeltrester",8.3125,0.29260000000000003,8.7999999999999995E-2,22,1.8287500000000001,8.3125,0]
["Bierhefe, flüssig",52.5,0.84000000000000008,0.26,10,5.2500000000000009,52.500000000000014,0]
["Biertreber, siliert",25,1,0.34249999999999997,25,6.25,25,0]
["Fischmehl",63,9.1728000000000005,6.8795999999999999,91,57.330000000000005,63,0]
["Getreideschlempe, frisch (Weizen)",36,3.456,0.69,60,21.6,36.000000000000007,0]
["Getreideschlempe, getrocknet (Weizen)",38.1875,5.6212,1.8952,92,35.1325,38.1875,0]
["Haferschälkleie",6.9999999999999991,1.0079999999999998,0.35100000000000003,90,6.2999999999999989,6.9999999999999991,0]
["Kartoffeleiweiß",84.000000000000014,12.096000000000002,1.0349999999999999,90,75.600000000000009,84.000000000000014,0]
["Kartoffelpülpe, siliert",4.875,0.1404,0.11520000000000001,18,0.87749999999999995,4.8749999999999991,0]
["Kartoffelschlempe, frisch",32.999999999999993,0.29039999999999994,8.4150000000000003E-2,5.5,1.8149999999999995,32.999999999999993,0]
["Leinextraktionsschrot",37.5625,5.3489000000000004,1.9580000000000002,89,33.430625000000006,37.562500000000007,0]
["Leinkuchen",37,5.3280000000000003,1.8540000000000001,90,33.300000000000004,37.000000000000007,0]
["Luzernegrünmehl",18.5,2.6640000000000001,0.72,90,16.650000000000002,18.500000000000004,0]
["Magermilch, frisch",36,0.48959999999999998,0.19464999999999999,8.5,3.06,36,0]
["Maiskeimextraktionsschrot",25,3.56,1.4239999999999999,89,22.25,25,0]
["Maiskleberfutter",25,3.6,1.7549999999999999,90,22.5,25,0]
["Malzkeime",29.500000000000004,4.3424000000000005,1.6836,92,27.140000000000004,29.500000000000004,0]
["Maniok",2.6875,0.37840000000000001,0.2024,88,2.3650000000000002,2.6875000000000004,0]
["Melasseschnitzel",10,1.456,0.1638,91,9.1,10,0]
["Molke, Permeat",4.1875,3.3500000000000002E-2,0.1535,5,0.20937500000000001,4.1875,0]
["Pressschnitzel, siliert",8.5,0.36719999999999997,6.2100000000000002E-2,27,2.2949999999999999,8.5,0]
["Rapsextraktionsschrot",38.125,5.4290000000000003,2.4475000000000002,89,33.931249999999999,38.125,0]
["Rapskuchen, fettarm",36.625,5.2740000000000009,2.4750000000000001,90,32.962500000000006,36.625000000000007,0]
["Roggengrießkleie",16,2.2528000000000001,2.0152000000000001,88,14.08,16,0]
["Roggenkleie",16.1875,2.2791999999999999,2.2351999999999999,88,14.244999999999999,16.1875,0]
["Rübenkleinteile",7.5,0.20400000000000001,8.1599999999999992E-2,17,1.2750000000000001,7.5000000000000009,0]
["Sojaextraktionsschrot, geschält, 48 % RP",54.500000000000007,7.6736000000000004,1.5136000000000001,88,47.96,54.500000000000007,0]
["Sojaextraktionsschrot, ungeschält, 44 % RP",50,7.04,1.4696,88,44,50,0]
["Sojaschalen",13.5,1.9008,0.3256,88,11.88,13.5,0]
["Sonnenblumenextraktionsschrot, teilgeschält",38,5.4112,2.2427999999999999,89,33.82,38,0]
["Sauermolke, frisch",9.875,0.10112000000000002,0.17600000000000002,6.4,0.63200000000000012,9.8750000000000018,0]
["Süßmolke, frisch",13.5,0.12959999999999999,9.1800000000000007E-2,6,0.80999999999999994,13.499999999999998,0]
["Trockenschnitzel",8.3125,1.1970000000000001,0.20699999999999999,90,7.4812500000000002,8.3125,0]
["Weizengrießkleie",16.073999999999998,2.4674999999999998,2.1087500000000001,87.5,{"$f":"+C112*5.7","v":14.06475},16.073999999999998,0]
["Weizenkleie",14.592000000000001,2.2528000000000001,2.6223999999999998,88,{"$f":"+C113*5.7","v":12.840960000000001},14.592000000000002,0]
["Weizennachmehl",17.327999999999999,2.6448,1.3920000000000001,87,15.07536,17.327999999999999,0]
["Zuckerrübenmelasse",13.5,1.6848000000000001,8.5800000000000001E-2,78,10.530000000000001,13.5,0]
[" +++sonstige Futtermittel+++"]
["Alleinfutter I Legehennen",19.885999999999999,2.7999488000000001,1.2600500000000001,88,17.499680000000001,19.885999999999999,0]
["Alleinfutter Jungsau",18.182000000000002,2.5600256000000003,1.03021688,88,16.000160000000001,18.182000000000002,0]
["Alleinfutter Schwein, Anfangsmast",19.885999999999999,2.7999488000000001,1.2600500000000001,88,17.499680000000001,19.885999999999999,0]
["Alleinfutter Schwein, Endmast",17.044999999999998,2.3999359999999998,1.03021688,88,14.999599999999999,17.044999999999998,0]
["Alleinfutter Schwein, Mast",19.318000000000001,2.7199744000000003,1.2600500000000001,88,16.999840000000003,19.318000000000001,0]
["Alleinfutter Zuchtsau, tragend",13.636363636363635,1.92,0.96222000000000008,88,12,13.636363636363635,0]
["Alleinfutter Zuchtsau, säugend",19,2.64,1.1455,88,{"$f":"+C123*6.25","v":16.5},18.75,0.25]
["Backabfälle",12.045000000000002,1.6959360000000001,0.5241808,88,10.599600000000001,12.045,0]
["Buttermilch",37.4,0.47872000000000003,0.15798735999999997,8,2.992,37.4,0]
["Ca-Propionat",0,0,0,99,0,0,0]
["DL-Methionin",99.298000000000002,15.84001696,0,99.7,99.000106000000002,99.298000000000002,0]
["Ergänz.futter Aufzuchtferkel, (Anteil 30 %)",39.773000000000003,5.6000384000000007,2.2902668799999999,88,35.000240000000005,39.77300000000001,0]
["Ergänz.futter Fohlen",18.408999999999999,2.5919872000000002,1.3910952000000001,88,16.199920000000002,18.409000000000002,0]
["Ergänz.futter I Schwein, Mast, (Anteil 30 %)",39.773000000000003,5.6000384000000007,1.3749665600000001,88,35.000240000000005,39.77300000000001,0]
["Ergänz.futter II Schwein, Mast, 28 % RP",31.818000000000001,4.4799743999999997,3.2075832800000001,88,27.999839999999999,31.817999999999998,0]
["Ergänz.futter Jungsau, (Anteil 30 %)",39.773000000000003,5.6000384000000007,1.8326167200000001,88,35.000240000000005,39.77300000000001,0]
["Ergänz.futter Saugferkel, (Anteil 100 %)",21.590999999999998,3.0400128,1.2600500000000001,88,19.000080000000001,{"$f":"+F133/E133*100","v":21.591000000000001},{"$f":"+B133-G133","v":0}]
["Ergänz.futter Schwein, Mast, (Anteil 20 %)",51.136000000000003,7.1999487999999996,1.6027835999999998,88,44.999679999999998,51.135999999999996,0]
["Ergänz.futter Schwein, Mast (30 %)",39.772727272727273,5.6,1.3745999999999998,88,35,39.772727272727273,0]
["Ergänz.futter Zuchtsau, säugend (Anteil 30 %)",39.773000000000003,5.6000384000000007,1.8326167200000001,88,35.000240000000005,39.77300000000001,0]
["Ergänz.futter Zuchtsau, tragend (Anteil 25 %)",28.409000000000002,3.9999872000000005,2.2902668799999999,88,24.999920000000003,28.409000000000002,0]
["Fasermix, 20 % Rohfaser",10,1.44,0.68661270000000008,90,9,10,0]
["Fasermix, 30 % Rohfaser",8.8889999999999993,1.280016,1.1464164000000001,90,8.0000999999999998,8.8889999999999993,0]
["Ferkelaufzuchtfutter I",20.455000000000002,2.880064,1.2600500000000001,88,18.000399999999999,20.454999999999998,0]
["Ferkelaufzuchtfutter II",19.885999999999999,2.7999488000000001,1.03021688,88,17.499680000000001,19.885999999999999,0]
["Futtersäure",0,0,0,99,0,0,0]
["Futterharnstoff",291.51499999999999,46.175976000000006,0,99,288.59985000000006,291.51500000000004,0]
["Futterzucker",0.10100000000000001,1.5998399999999999E-2,0,99,9.9989999999999996E-2,0.10100000000000001,0]
["Karottentrester",8.6875,0.23629999999999998,9.3500000000000014E-2,17,1.4768749999999999,8.6875,0]
["Kartoffelflocken",8.8640000000000008,1.2480512000000001,0.5241808,88,7.800320000000001,8.8640000000000008,0]
["Kartoffelschälabfälle, gedämpft",10.500000000000002,0.18480000000000002,6.3002500000000003E-2,11,1.155,10.5,0]
["Kartoffelstärke",0.34100000000000008,4.8012800000000008E-2,0.12096479999999998,88,0.30008000000000007,0.34100000000000008,0]
["Kohlensaurer Kalk",0,0,9.1365080000000001E-2,99.7,0,0,0]
["Lab-/Süßmolke",13.700000000000001,0.1096,9.8169350000000016E-2,5,0.68500000000000005,13.700000000000001,0]
["Futteröl",0,0,0,99.9,0,0,0]
["Lignozellulose",1.522,0.22403840000000003,4.2154400000000002E-2,92,1.4002400000000002,1.522,0]
["L-Lysin-HCl",79.188000000000002,12.480028799999999,0,98.5,78.00018,79.188000000000002,0]
["L-Threonin",98.99,15.680015999999998,0,99,98.000099999999989,98.99,0]
["Magermilch",36.1,0.49673599999999996,0.21475833999999999,8.6,3.1045999999999996,36.1,0]
["Magermilchpulver",36.451000000000001,5.4880625599999995,2.3282974800000003,94.1,34.300390999999998,36.451000000000001,0]
["Maiskornsilage",10,1.04,0.52,65,6.5,10,0]
["Maisschlempe, trocken",36,5.1840000000000002,1.0928070000000001,90,32.4,36,0]
["Mineralfutter Ferkel 4 AS (4 %)",21.578947368421055,3.28,5.73,95,20.5,21.578947368421055,0]
["Mineralfutter Schwein, Anfangsmast",21.578947368421055,3.28,2.2909999999999999,95,20.5,21.578947368421055,0]
["Mineralfutter Schwein, Endmast",17.894736842105267,2.72,0,95,17,17.894736842105264,0]
["Mineralfutter Zuchtsau, säugend (3,0 %)",13.684210526315791,2.08,6.8729999999999993,95,13,13.684210526315791,0]
["Mineralfutter Zuchtsau, tragend (2,5 %)",10,1.52,2.2909999999999999,95,{"$f":"+C163*6.25","v":9.5},10,0]
["Futterfett",0,0,0,99.9,0,0,0]
["Molkenpulver (Labmolke)",13.228999999999999,2.0319744000000002,1.8848515200000002,96,12.699840000000002,13.229000000000003,0]
["Monokalziumphosphat",0,0,52.452444999999997,95,0,0,0]
["Natriumbikarbonat",0,0,0,99,0,0,0]
["Propionsäure",0,0,0,99,0,0,0]
["Propylenglykol",0,0,0,99,0,0,0]
["Glyzerin (roh, rein)",0,0,0,99,0,0,0]
["Sauermilcherzeugnisse (Joghurt,Quark)",40,1.024,0.28225119999999998,16,6.4,40,0]
["Sauermolke",15.6,0.13977600000000001,0.20655656000000003,5.6000000000000005,0.87360000000000004,15.6,0]
["Sojakuchen, 8 % Rohfett",44.943999999999996,6.4000255999999993,1.4272929999999999,89,40.000159999999994,{"$f":"+F173/E173*100","v":44.943999999999996},{"$f":"+B173-G173","v":0}]
["Tryptophan",98.99,15.680015999999998,0,99,98.000099999999989,98.99,0]
["Viehsalz",0,0,0,99,0,0,0]
["Vollmilchergänzer",0,0,0,95,0,0,0]
["Vitaminkonzentrat",0,0,0,95,0,0,0]
[]
[]
[]
[]
[]
[]
["Alleinfutter Legehennen, N/P reduziert",19.318000000000001,2.7199744000000003,1.03021688,88,{"$f":"+C184*6.25","v":16.999840000000003},{"$f":"+F184/E184*100","v":19.318000000000001},{"$f":"+B184-G184","v":0}]
["Eiweißreicher Ergänzer Legehennen",34.091000000000008,4.8000128000000002,2.7499331200000001,88,30.000080000000001,34.091000000000001,0]
["Ergänz.futter Mastlämmer",20.682000000000002,2.9120256000000002,1.3910952000000001,88,18.20016,20.682000000000002,0]
["Ergänz.futter Pferde",16.135999999999999,2.2719488000000001,1.159246,88,14.199680000000001,16.135999999999999,0]
["Ergänz.futter Zuchtpferde",18.408999999999999,2.5919872000000002,1.159246,88,16.199920000000002,18.409000000000002,0]
["Ergänz.futter Zuchtschafe",18.408999999999999,2.5919872000000002,1.159246,88,16.199920000000002,18.409000000000002,0]
["Kälberaufzuchtfutter, 18 % RP",20.455000000000002,2.880064,1.1451334399999999,88,18.000399999999999,20.454999999999998,0]
["Kükenaufzuchtfutter",20.455000000000002,2.880064,1.6027835999999998,88,18.000399999999999,20.454999999999998,0]
["Legemehlergänzer Legehennen",22.955000000000002,3.2320640000000003,1.6229444000000002,88,20.200400000000002,22.955000000000002,0]
["Mastkükenfutter",25,3.5200000000000005,1.4898831199999998,88,22.000000000000004,25.000000000000007,0]
["Mastkükenfutter, N/P reduziert",23.864000000000001,3.3600512,1.2600500000000001,88,21.000319999999999,23.864000000000001,0]
["Milchaustauscher (MAT) Mast, 20 % Rohfett",23.403999999999996,3.5199615999999994,1.37395852,94,21.999759999999995,23.403999999999993,0]
["Milchleist.futter, 14 % RP, EnergieStufe 3",15.875,2.2399871999999998,0.91731640000000003,88,13.999919999999999,15.908999999999999,-3.399999999999892E-2]
["Milchleist.futter, 16 % RP, EnergieStufe 3",18.182000000000002,2.5600256000000003,0.91731640000000003,88,16.000160000000001,18.182000000000002,0]
["Milchleist.futter, 18 % RP, EnergieStufe 4",20.455000000000002,2.880064,0.91731640000000003,88,18.000399999999999,20.454999999999998,0]
["Milchleist.futter, 25 % RP, EnergieStufe 3",28.409000000000002,3.9999872000000001,1.3749665600000001,88,24.999919999999999,28.409000000000002,0]
["Milchleist.futter, 32 % RP, EnergieStufe 3",36.364000000000004,5.1200512000000007,1.6104000000000003,88,32.000320000000002,36.364000000000004,0]
["Milchleist.futter, 38 % RP, EnergieStufe 3",43.1875,6.0808,1.8326167200000001,88,38.005000000000003,43.1875,0]
["Mineralfutter Geflügel",8.4209999999999994,1.2799919999999998,16.036083600000001,95,7.9999499999999983,8.4209999999999976,0]
["Mineralfutter Pferde",0,0,11.45465635,95,0,0,0]
["Mineralfutter Rind, Milchkuh,   12 % Ca, 0 % P",0,0,0,95,0,0,0]
["Mineralfutter Rind, Milchkuh, 12 % Ca,  8 % P",0,0,18.32788545,95,0,0,0]
["Mineralfutter Rind, Milchkuh, 20 % Ca,  5 % P",0,0,11.45465635,95,0,0,0]
["Mineralfutter Rind, Milchkuh, 22 % Ca,  2 % P",0,0,4.5814272499999991,95,0,0,0]
["Mineralfutter Schafe",0,0,13.746458199999998,95,0,0,0]
["Mineralfutter, Rindermast 22 % Ca, 2 % P",0,0,4.3605,95,0,0,0]
["Mineralfutter, Rindermast 22 % Ca, 0 % P",0,0,0,95,0,0,0]
["Rindermastfutter, 40 % RP, EnergieStufe 3",45,6.3975999999999997,1.8326167200000001,88,39.984999999999999,45.4375,-0.4375]
[]
[]
[]
[]
[" +++Mehrschnittiger Feldfutterbau+++ "]
["Esparsette",20.3,0.65,0.14000000000000001,20,{"$f":"+C217*6.25","v":4.0625},20.3125,-1.2499999999999289E-2]
["Ackergras 3-4 Schnitte/Jahr ",16.2,0.52,0.16,20,3.25,16.25,-5.0000000000000711E-2]
["Ackergras 5 Schnitte/Jahr",16.600000000000001,0.53,0.16,20,3.3125,16.5625,3.7500000000001421E-2]
["Kleegras (Kleeanteil 30 %)",17.600000000000001,0.56000000000000005,0.15,20,3.5000000000000004,17.5,0.10000000000000142]
["Kleegras (Kleeanteil 50 %)",18.2,0.57999999999999996,0.14000000000000001,20,3.6249999999999996,18.124999999999996,7.5000000000002842E-2]
["Kleegras (Kleeanteil 70 %)",19.2,0.61,0.14000000000000001,20,3.8125,19.0625,0.13749999999999929]
["Luzernegras (Luz.anteil 30 %)",17.600000000000001,0.56000000000000005,0.15,20,3.5000000000000004,17.5,0.10000000000000142]
["Luzernegras (Luz.anteil 50 %)",18.2,0.57999999999999996,0.15,20,3.6249999999999996,18.124999999999996,7.5000000000002842E-2]
["Luzernegras (Luz.anteil 70 %)",19.2,0.61,0.14000000000000001,20,3.8125,19.0625,0.13749999999999929]
["Rotklee",20.46,0.65,0.13,20,4.0625,20.3125,0.14750000000000085]
["Luzerne",20.46,0.65,0.14000000000000001,20,4.0625,20.3125,0.14750000000000085]
[" +++Energiepflanzen+++",null,null,null,null,0,{"$error":"#DIV/0!"},{"$error":"#DIV/0!"}]
["Silphium, Silphie",null,0.28000000000000003,0.14000000000000001,28,1.7500000000000002,6.2500000000000018,-6.2500000000000018]
["Sorgumhirse"," ",0.41,0.18,28,2.5625,9.1517857142857135,{"$error":"#VALUE!"}]
["Sida (Virginiamalve)",null,0.34,0.17,28,2.125,7.5892857142857135,-7.5892857142857135]
["Igniscum ",null,0.31,0.11,28,1.9375,6.9196428571428577,-6.9196428571428577]
["Riesenweizengras (Szarvasi)",null,0.27,0.11,28,1.6875,6.0267857142857144,-6.0267857142857144]
["Chinaschilf (Miscanthus)",null,0.15,0.12,80,0.9375,1.171875,-1.171875]
["Switchgras",null,0.34,0.16,28,2.125,7.5892857142857135,-7.5892857142857135]
["Rohrglanzgras",null,0.41,0.15,28,2.5625,9.1517857142857135,-9.1517857142857135]
["GPS Hirse"," ",0.35,0.16,28,2.1875,7.8125,{"$error":"#VALUE!"}]
["GPS Amarant ",null,0.35,0.16,28,2.1875,7.8125,-7.8125]
["GPS Buchweizen",null,0.35,0.16,28,2.1875,7.8125,-7.8125]
["GPS Quinoa ",null,0.35,0.16,28,2.1875,7.8125,-7.8125]
[" +++Vermehrungspflanzen+++",null,null,null,null,0,{"$error":"#DIV/0!"},{"$error":"#DIV/0!"}]
["Grassamenvermehrung",null,2.2000000000000002,0.7,86,13.750000000000002,15.988372093023258,-15.988372093023258]
["Kleesamenvermehrung",null,5.5,1.46,91,34.375,37.77472527472527,-37.77472527472527]
["Luzernesamenvermehrung",null,5.5,1.46,91,34.375,37.77472527472527,-37.77472527472527]
["Phaceliasamenvermehrung",null,2.2000000000000002,0.7,91,13.750000000000002,15.109890109890111,-15.109890109890111]
["Wildkräutervermehr. (Leguminose)",null,2.8,1.5,91,17.5,19.230769230769234,-19.230769230769234]
["Wildkräuterverm. (Nichtleg.)",null,2.8,1.5,91,17.5,19.230769230769234,-19.230769230769234]
[" +++Dauerkulturen+++",null,null,null,null,0,{"$error":"#DIV/0!"},{"$error":"#DIV/0!"}]
["Erdbeeren",null,0.17,0.05,null,{"$f":"+C249*6.25","v":1.0625},{"$error":"#DIV/0!"},{"$error":"#DIV/0!"}]
["Himbeeren",null,0.2,0.04,null,1.25,{"$error":"#DIV/0!"},{"$error":"#DIV/0!"}]
["Johannis-/ Heidel-/ Holunderbeeren",null,0.2,0.1,null,1.25,{"$error":"#DIV/0!"},{"$error":"#DIV/0!"}]
["Kernobst",null,0.11,0.03,null,0.6875,{"$error":"#DIV/0!"},{"$error":"#DIV/0!"}]
["Steinobst",null,0.25,0.06,null,1.5625,{"$error":"#DIV/0!"},{"$error":"#DIV/0!"}]
["Streuobst",null,0.11,0.03,null,0.6875,{"$error":"#DIV/0!"},{"$error":"#DIV/0!"}]
["Reben (Trauben)",null,0.25,0.1,null,1.5625,{"$error":"#DIV/0!"},{"$error":"#DIV/0!"}]
["Rebschulen",null,0.3,0.1,null,1.875,{"$error":"#DIV/0!"},{"$error":"#DIV/0!"}]
["Haselnüsse",null,1.9,0.7,null,11.875,{"$error":"#DIV/0!"},{"$error":"#DIV/0!"}]
["Walnüsse",null,1.9,0.7,null,11.875,{"$error":"#DIV/0!"},{"$error":"#DIV/0!"}]
["Hopfen (10 % Wasser)",null,3,1,90,18.75,20.833333333333336,-20.833333333333336]
["Hopfen Rebenhäcksel",null,0.6,0.13,27,3.75,13.888888888888889,-13.888888888888889]
["Topinambur ",null,0.16,0.09,22,1,4.5454545454545459,-4.5454545454545459]
["Tabak (Burley dachtrocken)",null,4,0.7,null,25,{"$error":"#DIV/0!"},{"$error":"#DIV/0!"}]
["Trüffel",null,1.9,0.7,null,11.875,{"$error":"#DIV/0!"},{"$error":"#DIV/0!"}]
["Christbaumkulturen",null,0.5,0.3,null,3.125,{"$error":"#DIV/0!"},{"$error":"#DIV/0!"}]
["Baumschule",null,0.3,0.1,null,1.875,{"$error":"#DIV/0!"},{"$error":"#DIV/0!"}]
["Kurzumtriebsplantagen",null,0.3,0.1,null,1.875,{"$error":"#DIV/0!"},{"$error":"#DIV/0!"}]
["Rollrasen",null,0.25,0.12,null,1.5625,{"$error":"#DIV/0!"},{"$error":"#DIV/0!"}]
["Zierpflanzen (Gladiolen, Lilien...)",null,0.5,0.2,null,3.125,{"$error":"#DIV/0!"},{"$error":"#DIV/0!"}]
[" +++Zweitfrucht (2. Hauptfrucht)+++ ",null,null,null,null,0,{"$error":"#DIV/0!"},{"$error":"#DIV/0!"}]
["Weidelgras ",null,0.53,0.16,20,3.3125,16.5625,-16.5625]
["Kleegras mit 30 % Leguminosen",null,0.56000000000000005,0.15,20,3.5000000000000004,17.5,-17.5]
["Kleegras mit 50 % Leguminosen",null,0.57999999999999996,0.14000000000000001,20,3.6249999999999996,18.124999999999996,-18.124999999999996]
["Kleegras mit 70 % Leguminosen",null,0.61,0.14000000000000001,20,3.8125,19.0625,-19.0625]
["Alexandrinerklee",null,0.46,0.14000000000000001,20,2.875,{"$f":"+F274/E274*100","v":14.374999999999998},{"$f":"+B274-G274","v":-14.374999999999998}]
["Serradella kleinkörnig",null,0.46,0.14000000000000001,20,2.875,14.374999999999998,-14.374999999999998]
["GPS Futtererbsen/Ackerbohnen",null,0.46,0.14000000000000001,20,2.875,14.374999999999998,-14.374999999999998]
["GPS Sommerwicken",null,0.46,0.14000000000000001,20,2.875,14.374999999999998,-14.374999999999998]
["GPS Sommerraps",null,0.46,0.14000000000000001,20,2.875,14.374999999999998,-14.374999999999998]
["GPS Winterraps",null,0.46,0.14000000000000001,20,2.875,14.374999999999998,-14.374999999999998]
["GPS Winterrübsen",null,0.46,0.14000000000000001,20,2.875,14.374999999999998,-14.374999999999998]
["GPS Sommerrübsen",null,0.46,0.14000000000000001,20,2.875,14.374999999999998,-14.374999999999998]
["GPS Ölrettich",null,0.46,0.14000000000000001,20,2.875,14.374999999999998,-14.374999999999998]
["GPS Senf weiß/gelb",null,0.46,0.14000000000000001,20,{"$f":"+C283*6.25","v":2.875},14.374999999999998,-14.374999999999998]
["GPS Phacelia",null,0.46,0.14000000000000001,20,2.875,14.374999999999998,-14.374999999999998]
["GPS Sonnenblumen ",null,0.38,0.16,28,2.375,8.4821428571428577,-8.4821428571428577]
["GPS Gemenge mit 30 % Leguminosen",null,0.46,0.14000000000000001,20,2.875,14.374999999999998,-14.374999999999998]
["GPS Gemenge mit 50 % Leguminosen",null,0.46,0.14000000000000001,20,2.875,14.374999999999998,-14.374999999999998]
["GPS Gemenge mit 70 % Leguminosen ",null,0.46,0.14000000000000001,20,2.875,14.374999999999998,-14.374999999999998]
["GPS Winterroggen/Grünroggen",null,0.48,0.2,30,3,10,-10]
["Silomais",null,0.38,0.16,28,2.375,8.4821428571428577,-8.4821428571428577]
["GPS Sorghumhirse",null,0.41,0.18,28,2.5625,9.1517857142857135,-9.1517857142857135]
["Zwischenfrucht mit 0 - 25 % Leg.",null,0.46,0.14000000000000001,16,2.875,17.96875,-17.96875]
["Zwischenfrucht mit 25 - 75 % Leg.",null,0.46,0.14000000000000001,16,2.875,17.96875,-17.96875]
["Zwischenfrucht mit > 75 % Leg.",null,0.46,0.14000000000000001,16,2.875,17.96875,-17.96875]
[" +++Gemüse+++",null,null,null,null,0,{"$error":"#DIV/0!"},{"$error":"#DIV/0!"}]
["Artischocke",null,0.19,0.05,null,1.1875,{"$error":"#DIV/0!"},{"$error":"#DIV/0!"}]
["Auberginen",null,0.28000000000000003,0.05,null,1.7500000000000002,{"$error":"#DIV/0!"},{"$error":"#DIV/0!"}]
["Blattsalate",null,0.19,6.9000000000000006E-2,null,1.1875,{"$error":"#DIV/0!"},{"$error":"#DIV/0!"}]
["Blumenkohl",null,0.28000000000000003,0.10299999999999999,null,1.7500000000000002,{"$error":"#DIV/0!"},{"$error":"#DIV/0!"}]
["Brokkoli",null,0.45,0.14899999999999999,null,2.8125,{"$error":"#DIV/0!"},{"$error":"#DIV/0!"}]
["Buschbohnen",null,0.25,9.1999999999999998E-2,null,1.5625,{"$error":"#DIV/0!"},{"$error":"#DIV/0!"}]
["Chicoréerüben",null,0.25,0.121,null,1.5625,{"$error":"#DIV/0!"},{"$error":"#DIV/0!"}]
["Chinakohl",null,0.15,9.1999999999999998E-2,null,0.9375,{"$error":"#DIV/0!"},{"$error":"#DIV/0!"}]
["Eissalat",null,0.14000000000000001,5.7000000000000002E-2,null,0.87500000000000011,{"$error":"#DIV/0!"},{"$error":"#DIV/0!"}]
["Endivie, Frisèe",null,0.25,0.06,null,1.5625,{"$error":"#DIV/0!"},{"$error":"#DIV/0!"}]
["Endivie, glattblättrig",null,0.2,0.06,null,1.25,{"$error":"#DIV/0!"},{"$error":"#DIV/0!"}]
["Feldsalat",null,0.45,9.9000000000000005E-2,null,2.8125,{"$error":"#DIV/0!"},{"$error":"#DIV/0!"}]
["Gemüseerbsen",null,1,0.22900000000000001,null,6.25,{"$error":"#DIV/0!"},{"$error":"#DIV/0!"}]
["Grünkohl",null,0.49,0.16300000000000001,null,3.0625,{"$error":"#DIV/0!"},{"$error":"#DIV/0!"}]
["Gurke, Einlege-",null,0.15,6.9000000000000006E-2,null,0.9375,{"$error":"#DIV/0!"},{"$error":"#DIV/0!"}]
["Kichererbsen",null,1,0.23,null,6.25,{"$error":"#DIV/0!"},{"$error":"#DIV/0!"}]
["Knollenfenchel",null,0.2,6.9000000000000006E-2,null,1.25,{"$error":"#DIV/0!"},{"$error":"#DIV/0!"}]
["Kohlrabi",null,0.28000000000000003,0.10299999999999999,null,1.7500000000000002,{"$error":"#DIV/0!"},{"$error":"#DIV/0!"}]
["Kopfsalat",null,0.18,6.9000000000000006E-2,null,1.125,{"$error":"#DIV/0!"},{"$error":"#DIV/0!"}]
["Kürbis, Öl-",null,3,2.9,null,18.75,{"$error":"#DIV/0!"},{"$error":"#DIV/0!"}]
["Kürbis, Speise-",null,0.25,0.20599999999999999,null,1.5625,{"$error":"#DIV/0!"},{"$error":"#DIV/0!"}]
["Mairüben (mit Laub)",null,0.17,0.1,null,1.0625,{"$error":"#DIV/0!"},{"$error":"#DIV/0!"}]
["Markerbse",null,1,0.23,null,6.25,{"$error":"#DIV/0!"},{"$error":"#DIV/0!"}]
["Melone, Wasser-",null,9.6000000000000002E-2,0.02,null,0.6,{"$error":"#DIV/0!"},{"$error":"#DIV/0!"}]
["Melone, Zucker-, Honig-",null,0.15,5.3999999999999999E-2,null,0.9375,{"$error":"#DIV/0!"},{"$error":"#DIV/0!"}]
["Möhren, Bund-",null,0.17,8.2000000000000003E-2,null,1.0625,{"$error":"#DIV/0!"},{"$error":"#DIV/0!"}]
["Möhren, Industrie-",null,0.13,0.08,null,0.8125,{"$error":"#DIV/0!"},{"$error":"#DIV/0!"}]
["Möhren, Wasch-",null,0.13,0.08,null,0.8125,{"$error":"#DIV/0!"},{"$error":"#DIV/0!"}]
["Paprika",null,0.3,0.06,null,1.875,{"$error":"#DIV/0!"},{"$error":"#DIV/0!"}]
["Pastinake",null,0.25,0.23599999999999999,null,1.5625,{"$error":"#DIV/0!"},{"$error":"#DIV/0!"}]
["Petersilie, Wurzel-",null,0.42,0.13700000000000001,null,2.625,{"$error":"#DIV/0!"},{"$error":"#DIV/0!"}]
["Porree",null,0.25,0.08,null,1.5625,{"$error":"#DIV/0!"},{"$error":"#DIV/0!"}]
["Radicchio",null,0.25,9.1999999999999998E-2,null,1.5625,{"$error":"#DIV/0!"},{"$error":"#DIV/0!"}]
["Radies",null,0.2,6.9000000000000006E-2,null,1.25,{"$error":"#DIV/0!"},{"$error":"#DIV/0!"}]
["Rettich, Bund-",null,0.17,7.5999999999999998E-2,null,1.0625,{"$error":"#DIV/0!"},{"$error":"#DIV/0!"}]
["Rettich, deutsch",null,0.14000000000000001,0.08,null,0.87500000000000011,{"$error":"#DIV/0!"},{"$error":"#DIV/0!"}]
["Rettich, japanisch",null,0.1,0.06,null,0.625,{"$error":"#DIV/0!"},{"$error":"#DIV/0!"}]
["Rhabarber",null,0.18,4.8000000000000001E-2,null,1.125,{"$error":"#DIV/0!"},{"$error":"#DIV/0!"}]
["Romana",null,0.2,9.1999999999999998E-2,null,1.25,{"$error":"#DIV/0!"},{"$error":"#DIV/0!"}]
["Romana, Herzen",null,0.24,0.09,null,1.5,{"$error":"#DIV/0!"},{"$error":"#DIV/0!"}]
["Rosenkohl, nur Röschen",null,0.65,0.19500000000000001,null,4.0625,{"$error":"#DIV/0!"},{"$error":"#DIV/0!"}]
["Rote Rüben",null,0.28000000000000003,0.115,null,1.7500000000000002,{"$error":"#DIV/0!"},{"$error":"#DIV/0!"}]
["Rotkohl",null,0.22,0.08,null,1.375,{"$f":"+F338/E338*100","v":{"$error":"#DIV/0!"}},{"$f":"+B338-G338","v":{"$error":"#DIV/0!"}}]
["Rucola",null,0.4,0.10299999999999999,null,2.5,{"$error":"#DIV/0!"},{"$error":"#DIV/0!"}]
["Salate, Baby Leaf Lettuce",null,0.35,0.08,null,2.1875,{"$error":"#DIV/0!"},{"$error":"#DIV/0!"}]
["Schwarzwurzel",null,0.23,0.16,null,1.4375,{"$error":"#DIV/0!"},{"$error":"#DIV/0!"}]
["Sellerie, Bund-",null,0.27,0.126,null,1.6875,{"$error":"#DIV/0!"},{"$error":"#DIV/0!"}]
["Sellerie, Knollen-",null,0.25,0.14899999999999999,null,1.5625,{"$error":"#DIV/0!"},{"$error":"#DIV/0!"}]
["Sellerie, Stangen-",null,0.25,0.115,null,1.5625,{"$error":"#DIV/0!"},{"$error":"#DIV/0!"}]
["Spargel",null,0.26,8.2000000000000003E-2,null,1.625,{"$error":"#DIV/0!"},{"$error":"#DIV/0!"}]
["Spinat, Blatt-, Frischmarkt, Baby",null,0.45,0.12,null,2.8125,{"$error":"#DIV/0!"},{"$error":"#DIV/0!"}]
["Spinat, Blatt-, Standard",null,0.4,0.12,null,{"$f":"+C347*6.25","v":2.5},{"$error":"#DIV/0!"},{"$error":"#DIV/0!"}]
["Spinat, Hack-, Standard",null,0.36,0.12,null,2.25,{"$error":"#DIV/0!"},{"$error":"#DIV/0!"}]
["Stangenbohne",null,0.25,0.09,null,1.5625,{"$error":"#DIV/0!"},{"$error":"#DIV/0!"}]
["Süßkartoffel",null,0.26,0.09,null,1.625,{"$error":"#DIV/0!"},{"$error":"#DIV/0!"}]
["Teltower Rübchen (Herbstanbau)",null,0.45,0.24,null,2.8125,{"$error":"#DIV/0!"},{"$error":"#DIV/0!"}]
["Tomate",null,0.3,0.05,null,1.875,{"$error":"#DIV/0!"},{"$error":"#DIV/0!"}]
["Weißkohl",null,0.2,7.2999999999999995E-2,null,1.25,{"$error":"#DIV/0!"},{"$error":"#DIV/0!"}]
["Wirsing",null,0.35,0.115,null,2.1875,{"$error":"#DIV/0!"},{"$error":"#DIV/0!"}]
["Zucchini",null,0.16,0.06,null,1,{"$error":"#DIV/0!"},{"$error":"#DIV/0!"}]
["Zuckerhut",null,0.2,0.115,null,1.25,{"$error":"#DIV/0!"},{"$error":"#DIV/0!"}]
["Zuckermais",null,0.35,0.16,null,2.1875,{"$error":"#DIV/0!"},{"$error":"#DIV/0!"}]
["Zwiebel, Bund-",null,0.2,0.06,null,1.25,{"$error":"#DIV/0!"},{"$error":"#DIV/0!"}]
["Zwiebel, Trocken-",null,0.18,0.08,null,1.125,{"$error":"#DIV/0!"},{"$error":"#DIV/0!"}]
[" +++Heil- und Gewürzpflanzen+++",null,null,null,null,0,{"$error":"#DIV/0!"},{"$error":"#DIV/0!"}]
["Akelei (Blühendes Kraut)",null,0.45999999999999996,0.137484,null,2.875,{"$error":"#DIV/0!"},{"$error":"#DIV/0!"}]
["Alant (Wurzeln)",null,0.5,0.21,null,3.125,{"$error":"#DIV/0!"},{"$error":"#DIV/0!"}]
["Ampfer, Krauser (Kraut nach der Blüte)",null,0.5,0.16,null,3.125,{"$error":"#DIV/0!"},{"$error":"#DIV/0!"}]
["Ampfer, Wiesen- (Blatt)",null,0.33,0.11,null,2.0625,{"$error":"#DIV/0!"},{"$error":"#DIV/0!"}]
["Anis (Samen (Droge!))",null,2.65,1.1499999999999999,null,16.5625,{"$error":"#DIV/0!"},{"$error":"#DIV/0!"}]
["Arzneifenchel (Früchte (Droge!))",null,2.78,1.26,null,17.375,{"$error":"#DIV/0!"},{"$error":"#DIV/0!"}]
["Arzneirhabarber (Wurzeln)",null,0.4,0.25,null,2.5,{"$error":"#DIV/0!"},{"$error":"#DIV/0!"}]
["Bärlauch (Blätter)",null,0.5,0.75,null,3.125,{"$error":"#DIV/0!"},{"$error":"#DIV/0!"}]
["Baikal-Helmkraut (Wurzeln)",null,0.75,0.25,null,4.6875,{"$error":"#DIV/0!"},{"$error":"#DIV/0!"}]
["Baldrian (Wurzeln)",null,0.28999999999999998,0.19,null,1.8124999999999998,{"$error":"#DIV/0!"},{"$error":"#DIV/0!"}]
["Basilikum (Kraut b. Blühbeginn)",null,0.33,0.09,null,2.0625,{"$error":"#DIV/0!"},{"$error":"#DIV/0!"}]
["Bergarnika (Blütenkörbe)",null,0.4,0.16,null,2.5,{"$error":"#DIV/0!"},{"$error":"#DIV/0!"}]
["Bergbohnenkraut (Blühendes Kraut)",null,0.65,0.16,null,4.0625,{"$error":"#DIV/0!"},{"$error":"#DIV/0!"}]
["Besenbeifuß (A. scoparia) (Kraut)",null,0.59,0.15,null,3.6875,{"$error":"#DIV/0!"},{"$error":"#DIV/0!"}]
["Bibernelle, Kleine (Wurzeln)",null,0.35,0.17,null,2.1875,{"$error":"#DIV/0!"},{"$error":"#DIV/0!"}]
["Blaue Malve (blühendes Kraut)",null,0.35,0.16,null,2.1875,{"$error":"#DIV/0!"},{"$error":"#DIV/0!"}]
["Blaue Malve (Blüten)",null,0.3,0.16,null,1.875,{"$error":"#DIV/0!"},{"$error":"#DIV/0!"}]
["Bockshornklee (Samen (Droge!))",null,3.87,1.4,null,24.1875,{"$error":"#DIV/0!"},{"$error":"#DIV/0!"}]
["Bohnenkraut, einjährig (Blühendes Kraut)",null,0.32,0.12,null,2,{"$error":"#DIV/0!"},{"$error":"#DIV/0!"}]
["Borretsch (Blühendes Kraut)",null,0.15,0.05,null,0.9375,{"$error":"#DIV/0!"},{"$error":"#DIV/0!"}]
["Braunelle (Kraut zu Ende der Blüte)",null,0.34,0.17,null,2.125,{"$error":"#DIV/0!"},{"$error":"#DIV/0!"}]
["Brennnessel, Große (Nicht blühendes Kraut)",null,0.59,0.16,null,3.6875,{"$error":"#DIV/0!"},{"$error":"#DIV/0!"}]
["Brennnessel, Kleine (Blühendes Kraut)",null,0.7,0.15,null,4.375,{"$error":"#DIV/0!"},{"$error":"#DIV/0!"}]
["Brunnenkresse (Kraut)",null,0.3,9.1999999999999998E-2,null,1.875,{"$error":"#DIV/0!"},{"$error":"#DIV/0!"}]
["Dill, Frischmarkt (Kraut)",null,0.3,9.1999999999999998E-2,null,1.875,{"$error":"#DIV/0!"},{"$error":"#DIV/0!"}]
["Dill, Industrieware (Kraut b. Knospenansatz)",null,0.3,9.1999999999999998E-2,null,1.875,{"$error":"#DIV/0!"},{"$error":"#DIV/0!"}]
["Dost, Oregano (Blühendes Kraut)",null,0.5,0.14000000000000001,null,3.125,{"$error":"#DIV/0!"},{"$error":"#DIV/0!"}]
["Drachenkopf (Blühendes Kraut)",null,0.27,0.11,null,1.6875,{"$error":"#DIV/0!"},{"$error":"#DIV/0!"}]
["Eibisch (Wurzeln)",null,0.66,0.3,null,4.125,{"$error":"#DIV/0!"},{"$error":"#DIV/0!"}]
["Eisenkraut, Echtes (Kraut)",null,0.48,0.14000000000000001,null,3,{"$error":"#DIV/0!"},{"$error":"#DIV/0!"}]
["Engelwurz, Chinesische (Wurzeln)",null,0.42,0.25,null,2.625,{"$error":"#DIV/0!"},{"$error":"#DIV/0!"}]
["Engelwurz, Europäische (Wurzeln)",null,0.3,0.23,null,1.875,{"$error":"#DIV/0!"},{"$error":"#DIV/0!"}]
["Enzian (Wurzeln nach 4 Jahren)",null,0.3,0.2,null,1.875,{"$error":"#DIV/0!"},{"$error":"#DIV/0!"}]
["Estragon, Deutscher (Nicht blühendes Kraut)",null,0.55000000000000004,0.16,null,3.4375000000000004,{"$error":"#DIV/0!"},{"$error":"#DIV/0!"}]
["Färberdistel (Samen)",null,2.06,1.1200000000000001,null,12.875,{"$error":"#DIV/0!"},{"$error":"#DIV/0!"}]
["Federmohn, 1. Standjahr (Kraut)",null,0.52,0.08,null,3.25,{"$error":"#DIV/0!"},{"$error":"#DIV/0!"}]
["Federmohn, ab 2. Standjahr (Kraut)",null,0.36,0.05,null,2.25,{"$error":"#DIV/0!"},{"$error":"#DIV/0!"}]
["Frauenmantel (Blühendes Kraut)",null,0.38,0.13739999999999999,null,2.375,{"$error":"#DIV/0!"},{"$error":"#DIV/0!"}]
["Galega (Geißraute) (Kraut)",null,0.37,0.08,null,2.3125,{"$error":"#DIV/0!"},{"$error":"#DIV/0!"}]
["Gartenkresse (Kraut)",null,0.67200000000000004,8.6999999999999994E-2,null,4.2,{"$error":"#DIV/0!"},{"$error":"#DIV/0!"}]
["Goldrute (Blühhorizont)",null,0.6,0.21,null,3.75,{"$error":"#DIV/0!"},{"$error":"#DIV/0!"}]
["Johanniskraut (Blühendes Kraut)",null,0.53,0.2,null,3.3125,{"$f":"+F402/E402*100","v":{"$error":"#DIV/0!"}},{"$f":"+B402-G402","v":{"$error":"#DIV/0!"}}]
["Kamille (Blüten, Blühhorizont)",null,0.42,0.21,null,2.625,{"$error":"#DIV/0!"},{"$error":"#DIV/0!"}]
["Kapuzinerkresse (Blühendes Kraut)",null,0.35,0.09,null,2.1875,{"$error":"#DIV/0!"},{"$error":"#DIV/0!"}]
["Kerbel (Kraut)",null,0.41,0.1,null,2.5625,{"$error":"#DIV/0!"},{"$error":"#DIV/0!"}]
["Koriander, Kraut (Kraut für Blattdroge)",null,0.41,0.1,null,2.5625,{"$error":"#DIV/0!"},{"$error":"#DIV/0!"}]
["Koriander (Samen (Droge!))",null,2.6,1.1000000000000001,null,16.25,{"$error":"#DIV/0!"},{"$error":"#DIV/0!"}]
["Kornblume, blüh. Kraut (Blühendes Kraut)",null,0.37,0.1,null,2.3125,{"$error":"#DIV/0!"},{"$error":"#DIV/0!"}]
["Kornblume, Blüten (Blüten)",null,0.44,0.19,null,2.75,{"$error":"#DIV/0!"},{"$error":"#DIV/0!"}]
["Kümmel (Früchte (Droge!))",null,2.65,1.1499999999999999,null,16.5625,{"$error":"#DIV/0!"},{"$error":"#DIV/0!"}]
["Lavendel (Blütenähren)",null,0.51,0.13,null,{"$f":"+C411*6.25","v":3.1875},{"$error":"#DIV/0!"},{"$error":"#DIV/0!"}]
["Liebstöckel (Nicht blühendes Kraut)",null,0.37,0.11,null,2.3125,{"$error":"#DIV/0!"},{"$error":"#DIV/0!"}]
["Löwenzahn (Kraut)",null,0.33,0.11,null,2.0625,{"$error":"#DIV/0!"},{"$error":"#DIV/0!"}]
["Löwenzahn, Kaukasischer (Wurzeln)",null,0.5,0.21,null,3.125,{"$error":"#DIV/0!"},{"$error":"#DIV/0!"}]
["Mädesüß (Blühendes Kraut)",null,0.49,0.2,null,3.0625,{"$error":"#DIV/0!"},{"$error":"#DIV/0!"}]
["Majoran (Kraut bei Blühbeginn)",null,0.48,0.14000000000000001,null,3,{"$error":"#DIV/0!"},{"$error":"#DIV/0!"}]
["Mariendistel (Samen (Droge!))",null,2.06,1.1200000000000001,null,12.875,{"$error":"#DIV/0!"},{"$error":"#DIV/0!"}]
["Meerrettich (Wurzeln)",null,0.7,0.22,null,4.375,{"$error":"#DIV/0!"},{"$error":"#DIV/0!"}]
["Melde (Kraut)",null,0.33,0.11,null,2.0625,{"$error":"#DIV/0!"},{"$error":"#DIV/0!"}]
["Mohn (Samen und Kapseln)",null,1.5913978494623655,0.94623655913978499,null,9.9462365591397841,{"$error":"#DIV/0!"},{"$error":"#DIV/0!"}]
["Muskatteller Salbei (Blühendes Kraut)",null,0.24,7.0000000000000007E-2,null,1.5,{"$error":"#DIV/0!"},{"$error":"#DIV/0!"}]
["Mutterkraut (T. parthenium) (Blühendes Kraut)",null,0.45,0.16,null,2.8125,{"$error":"#DIV/0!"},{"$error":"#DIV/0!"}]
["Mutterkraut, Chin. (L. jap.) (Blühendes Kraut)",null,0.51,0.14000000000000001,null,3.1875,{"$error":"#DIV/0!"},{"$error":"#DIV/0!"}]
["Nachtkerze (Samen (Droge!))",null,2.06,1.1200000000000001,null,12.875,{"$error":"#DIV/0!"},{"$error":"#DIV/0!"}]
["Petersilie, Blatt- (Blätter bis 1. Schnitt)",null,0.45,0.115,null,2.8125,{"$error":"#DIV/0!"},{"$error":"#DIV/0!"}]
["Petersilie, Blatt- (Blatt nach 1 Schnitt)",null,0.45,0.115,null,2.8125,{"$error":"#DIV/0!"},{"$error":"#DIV/0!"}]
["Pfefferminze, Minzen (Nicht blühendes Kraut)",null,0.42,0.11,null,2.625,{"$error":"#DIV/0!"},{"$error":"#DIV/0!"}]
["Ringelblume, blüh. Kraut (Blühendes Kraut)",null,0.28999999999999998,7.0000000000000007E-2,null,1.8124999999999998,{"$error":"#DIV/0!"},{"$error":"#DIV/0!"}]
["Ringelblume, Blüte (Blütenkörbe)",null,0.3,0.12,null,1.875,{"$error":"#DIV/0!"},{"$error":"#DIV/0!"}]
["Rosmarin (Nicht blühendes Kraut)",null,0.58333333333333337,0.09,null,3.6458333333333335,{"$error":"#DIV/0!"},{"$error":"#DIV/0!"}]
["Rotwurzelsalbei (S. miltior.) (Wurzeln)",null,0.36,0.13,null,2.25,{"$error":"#DIV/0!"},{"$error":"#DIV/0!"}]
["Salbei (Salvia officinalis) (Nicht blühendes Kraut)",null,0.49,0.11,null,3.0625,{"$error":"#DIV/0!"},{"$error":"#DIV/0!"}]
["Saposhnikovia (Wurzel)",null,0.5,0.23,null,3.125,{"$error":"#DIV/0!"},{"$error":"#DIV/0!"}]
["Saussurea costus (Wurzel)",null,0.5,0.21,null,3.125,{"$error":"#DIV/0!"},{"$error":"#DIV/0!"}]
["Schabzigerklee (Blühendes Kraut)",null,0.37,0.08,null,2.3125,{"$error":"#DIV/0!"},{"$error":"#DIV/0!"}]
["Schafgarbe (Blühhorizont)",null,0.46,0.16,null,2.875,{"$error":"#DIV/0!"},{"$error":"#DIV/0!"}]
["Schleifenblume, Bittere (Kraut)",null,0.35,0.09,null,2.1875,{"$error":"#DIV/0!"},{"$error":"#DIV/0!"}]
["Schlüsselblume (Wurzeln)",null,0.27,0.15,null,1.6875,{"$error":"#DIV/0!"},{"$error":"#DIV/0!"}]
["Schnittknoblauch (Kraut)",null,0.5,0.14000000000000001,null,3.125,{"$error":"#DIV/0!"},{"$error":"#DIV/0!"}]
["Schnittlauch (Kraut, bis 1. Schnitt)",null,0.5,0.13700000000000001,null,3.125,{"$error":"#DIV/0!"},{"$error":"#DIV/0!"}]
["Schnittlauch, nach 1. Schnitt (gesät, nach 1 Schnitt)",null,0.5,0.13700000000000001,null,3.125,{"$error":"#DIV/0!"},{"$error":"#DIV/0!"}]
["Schnittlauch, für Treiberei (Anbau f. Treiberei)",null,0.5,0.13700000000000001,null,3.125,{"$error":"#DIV/0!"},{"$error":"#DIV/0!"}]
["Schöllkraut (Blühendes Kraut)",null,0.4,0.11,null,2.5,{"$error":"#DIV/0!"},{"$error":"#DIV/0!"}]
["Sellerie, Schnitt- (Kraut)",null,0.37,0.11,null,2.3125,{"$error":"#DIV/0!"},{"$error":"#DIV/0!"}]
["Senf, Brauner (Samen)",null,5,1.77,null,31.25,{"$error":"#DIV/0!"},{"$error":"#DIV/0!"}]
["Senf, Gelber/Weißer (Samen)",null,5,1.77,null,31.25,{"$error":"#DIV/0!"},{"$error":"#DIV/0!"}]
["Siegesbeckia (Blühendes Kraut)",null,0.26,0.1,null,1.625,{"$error":"#DIV/0!"},{"$error":"#DIV/0!"}]
["Sonnenhut (E.angustifolia) (Blühendes Kraut)",null,0.56000000000000005,0.12,null,3.5000000000000004,{"$error":"#DIV/0!"},{"$error":"#DIV/0!"}]
["Sonnenhut (E.angustifolia) (Wurzeln)",null,0.95,0.2,null,5.9375,{"$error":"#DIV/0!"},{"$error":"#DIV/0!"}]
["Sonnenhut (E.pallida) (Blühendes Kraut)",null,0.31,0.1,null,1.9375,{"$error":"#DIV/0!"},{"$error":"#DIV/0!"}]
["Sonnenhut (E.pallida) (Wurzeln)",null,0.57999999999999996,0.14000000000000001,null,3.6249999999999996,{"$error":"#DIV/0!"},{"$error":"#DIV/0!"}]
["Sonnenhut (E.purpurea) (Blühendes Kraut)",null,0.44,0.13,null,2.75,{"$error":"#DIV/0!"},{"$error":"#DIV/0!"}]
["Sonnenhut (E.purpurea) (Wurzeln)",null,0.46,0.14000000000000001,null,2.875,{"$error":"#DIV/0!"},{"$error":"#DIV/0!"}]
["Spitzwegerich (Kraut)",null,0.33,0.11,null,2.0625,{"$error":"#DIV/0!"},{"$error":"#DIV/0!"}]
["Steinklee, Gelber (Blühendes Kraut)",null,0.57999999999999996,0.14000000000000001,null,3.6249999999999996,{"$error":"#DIV/0!"},{"$error":"#DIV/0!"}]
["Schwarzkümmel (Samen (Droge!))",null,3.6,1.71,null,22.5,{"$error":"#DIV/0!"},{"$error":"#DIV/0!"}]
["Thymian (Blühendes Kraut)",null,0.44,0.12,null,2.75,{"$error":"#DIV/0!"},{"$error":"#DIV/0!"}]
["Tollkirsche (Kraut)",null,0.73,0.46,null,4.5625,{"$error":"#DIV/0!"},{"$error":"#DIV/0!"}]
["Tragant, Chinesischer (Wurzeln)",null,0.56999999999999995,0.25,null,3.5624999999999996,{"$error":"#DIV/0!"},{"$error":"#DIV/0!"}]
["Wermut, Beifuß (Nicht blühendes Kraut)",null,0.39,0.17,null,2.4375,{"$error":"#DIV/0!"},{"$error":"#DIV/0!"}]
["Wiesenknopf, Kleiner (Kraut)",null,0.41,0.1,null,2.5625,{"$error":"#DIV/0!"},{"$error":"#DIV/0!"}]
["Winterheckenzwiebel (Kraut)",null,0.5,0.14000000000000001,null,3.125,{"$error":"#DIV/0!"},{"$error":"#DIV/0!"}]
["Ysop (Blühendes Kraut)",null,0.42,0.1,null,2.625,{"$error":"#DIV/0!"},{"$error":"#DIV/0!"}]
["Zitronenmelisse (Nicht blühendes Kraut)",null,0.49,0.14000000000000001,null,3.0625,{"$error":"#DIV/0!"},{"$error":"#DIV/0!"}]
["Zitronenverbene (Kraut)",null,0.48,0.14000000000000001,null,3,{"$error":"#DIV/0!"},{"$error":"#DIV/0!"}]
[" +++Grünland+++",null,null,null,null,0,{"$f":"+F466/E466*100","v":{"$error":"#DIV/0!"}},{"$f":"+B466-G466","v":{"$error":"#DIV/0!"}}]
["Streuwiese",8,1.28,0.46,100,8,8,0]
["1 Schnittnutzung",8.6,1.3759999999999999,0.5,100,8.6,8.6,0]
["2 Schnittnutzungen",11.4,1.8240000000000001,0.65,100,11.4,11.4,0]
["3 Schnittnutzungen",15,2.4,0.71,100,15,15,0]
["4 Schnittnutzungen",17,2.72,0.81,100,17,17,0]
["5 Schnittnutzungen",17.5,2.8,0.87,100,17.5,17.5,0]
["6 Schnittnutzungen",18.2,2.9119999999999999,0.89,100,18.2,18.2,0]
["Mähweide extensiv 20 % Weide",12.375,1.98,0.69,100,12.375,12.375,0]
["Mähweide mittelintensiv 20 % Weide",17.1875,2.75,0.76,100,{"$f":"+C475*6.25","v":17.1875},17.1875,0]
["Mähweide intensiv 20 % Weide",17.5,2.8,0.85,100,17.5,17.5,0]
["Mähweide extensiv 60 % Weide",12.5,2,0.69,100,12.5,12.5,0]
["Mähweide mittelintensiv 60 % Weide",16.3125,2.61,0.76,100,16.3125,16.3125,0]
["Mähweide intensiv 60 % Weide",17.600000000000001,2.82,0.85,100,17.625,17.625,-2.4999999999998579E-2]
["Weide extensiv",12.5,2,0.71,100,12.5,12.5,0]
["Weide mittel",15.3,2.448,0.8,100,15.299999999999999,15.299999999999999,0]
["Weide intensiv",18,2.88,0.89,100,18,18,0]
["Hutungen",10,1.6,0.56999999999999995,100,10,10,0]
["Almen",14,2.2400000000000002,0.73,100,14.000000000000002,14.000000000000002,0]

{"sheet":"Futtermittel unsortiert","index":3,"n_rows":474,"n_cols":26,"rows_kept":474,"cut":false,"hidden":true,"merged":[[2,7,2,12],[2,15,2,20],[3,7,3,12],[3,15,3,20]]}
[null,null,null,null,null,"Tabelle 7: Nährstoffgehalte von Ernteprodukten, Futtermitteln und Bioagssubstraten"]
[null,null,null,null,null,"                 (Stand: November 2018)"]
[null,null,null,null,null,null,null,"Nährstoffgehalt ",null,null,null,null,null,null,null,"Nährstoffgehalt ",null,null,null,null,null,null,"Roh-","Grob-","Quelle","Code Grub"]
["Ernteprodukt","Futtermittel","Frucharten-","Sortierung","erzeugt",null,"Programmname","in kg/dt TM",null,null,null,null,null,null,"TM","in kg/dt FM",null,null,null,null,null,null,"protein","futter","FutMit","FutMit"]
[null,null,"gruppe","FutMit","auf",null,null,"N","P2O5","P","K2O","K","MgO","S","in %","N","P2O5","P","K2O","K","MgO","S","% in TM"]
[null,null,null,null,null,null," --"]
[null,null,1,null,null,"Getreide"," +++Getreide+++ ",null,null,null,null,null,null,null,null,null,null,null,null,null," ",null,null,null,"1a"]
[1,2,1,1,"Acker",null,"Winterweizen C-Sorte",{"$f":"+P8/$O8*100","v":2.1046511627906979},0.93023255813953487,0.40697674418604651,0.63953488372093026,0.53073434333687164,0.23255813953488372,0.16837209302325581,86,1.81,0.8,0.35,0.55000000000000004,0.45643153526970953,0.2,0.14480000000000001,12,null,"1a"]
[1,2,1,1,"Acker",null,"Winterweizen A/B-Sorte",2.4534883720930232,0.93023255813953487,0.40697674418604651,0.63953488372093026,0.53073434333687164,0.23255813953488372,0.15348837209302327,86,2.11,0.8,0.35,0.55000000000000004,0.45643153526970953,0.2,0.13200000000000001,14,{"$f":"+IF(B9=1,\"ja\",\"\")","v":""},"1a"]
[1,2,1,1,"Acker",null,"Winterweizen E-Sorte",2.8023255813953489,0.93023255813953487,0.40697674418604651,0.63953488372093026,0.53073434333687164,0.23255813953488372,0.22418604651162793,86,2.41,0.8,0.35,0.55000000000000004,0.45643153526970953,0.2,0.19280000000000003,16,"","1a"]
[1,2,1,1,"Acker",null,"Winterbrauweizen",2.1046511627906979,0.87209302325581395,0.40697674418604651,0.63953488372093026,0.53488372093023262,0.23255813953488372,0.16279069767441862,86,1.81,0.75,0.35,0.55000000000000004,0.46,0.2,0.14000000000000001,12,null,"1a"]
[1,2,1,1,"Acker",null,"Sommerweizen",2.4534883720930232,0.87209302325581395,0.40697674418604651,0.63953488372093026,0.53073434333687164,0.23255813953488372,0.15348837209302327,86,2.11,0.75,0.35,0.55000000000000004,0.45643153526970953,0.2,0.13200000000000001,14,"","1a"]
[2,1,1,16,"Acker",null,"Weizenstroh",0.58139534883720934,0.34883720930232559,0.15116279069767444,1.6279069767441861,1.3509601466756729,0.23255813953488372,0.1,86,0.5,0.3,0.13,1.4,1.1618257261410787,0.2,8.5999999999999993E-2,"  ",{"$f":"+IF(B13=1,\"ja\",\"\")","v":"ja"},"1a"]
[1,2,1,1,"Acker",null,"Wintergerste ",1.9186046511627906,0.93023255813953487,0.40697674418604651,0.69767441860465118,0.57898292000385987,0.23255813953488372,0.15348837209302327,86,1.65,0.8,0.35,0.6,0.49792531120331945,0.2,0.13200000000000001,12,"","1a"]
[1,2,1,1,"Acker",null,"Winterbraugerste",1.7558139534883721,0.93023255813953487,0.40697674418604651,0.69767441860465118,0.58139534883720934,0.23255813953488372,0.13953488372093023,86,1.51,0.8,0.35,0.6,0.5,0.2,0.12,11,null,"1a"]
[1,2,1,1,"Acker",null,"Sommerfuttergerste",1.9186046511627906,0.93023255813953487,0.40697674418604651,0.69767441860465118,0.57898292000385987,0.23255813953488372,0.15348837209302327,86,1.65,0.8,0.35,0.6,0.49792531120331945,0.2,0.13200000000000001,12,"","1a"]
[1,2,1,1,"Acker",null,"Sommerbraugerste",1.6046511627906976,0.93023255813953487,0.40697674418604651,0.69767441860465118,0.57898292000385987,0.23255813953488372,0.12837209302325583,86,1.38,0.8,0.35,0.6,0.49792531120331945,0.2,0.1104,10,"","1a"]
[2,1,1,16,"Acker",null,"Gerstenstroh",0.58139534883720934,0.34883720930232559,0.15116279069767444,1.9767441860465116,1.6404516066776029,0.11627906976744186,4.6511627906976744E-2,86,0.5,0.3,0.13,1.7,1.4107883817427385,0.1,0.04," ",{"$f":"+IF(B18=1,\"ja\",\"\")","v":"ja"},"1a"]
[1,2,1,1,"Acker",null,"Winterroggen",1.7558139534883721,0.93023255813953487,0.40697674418604651,0.69767441860465118,0.57898292000385987,0.11627906976744186,0.14046511627906977,86,1.51,0.8,0.35,0.6,0.49792531120331945,0.1,0.1208,11,"","1a"]
[1,2,1,1,"Acker",null,"Sommerroggen",1.7558139534883721,0.93023255813953487,0.40603778181559802,0.69767441860465118,0.57898292000385987,0.11627906976744186,0.14046511627906977,86,1.51,0.8,0.34919249236141425,0.6,0.49792531120331945,0.1,0.1208,11,"","1a"]
[2,1,1,16,"Acker",null,"Roggenstroh",0.58139534883720934,0.34883720930232559,0.15116279069767444,2.3255813953488373,1.9299430666795327,0.23255813953488372,4.6511627906976744E-2,86,0.5,0.3,0.13,2,1.6597510373443982,0.2,0.04," ",{"$f":"+IF(B21=1,\"ja\",\"\")","v":"ja"},"1a"]
[1,2,1,1,"Acker",null,"Hafer",1.7558139534883721,0.93023255813953487,0.40697674418604651,0.69767441860465118,0.57898292000385987,0.23255813953488372,0.14046511627906977,86,1.51,0.8,0.35,0.6,0.49792531120331945,0.2,0.1208,11,"","1a"]
[2,1,1,16,"Acker",null,"Haferstroh",0.58139534883720934,0.34883720930232559,0.15116279069767444,1.9767441860465116,1.6404516066776029,0.23255813953488372,4.6511627906976744E-2,86,0.5,0.3,0.13,1.7,1.4107883817427385,0.2,0.04," ","ja","1a"]
[1,2,1,1,"Acker",null,"Triticale",{"$f":"+P24/$O24*100","v":1.9186046511627906},0.93023255813953487,0.40697674418604651,0.69767441860465118,0.57898292000385987,0.23255813953488372,0.15348837209302327,86,1.65,0.8,0.35,0.6,0.49792531120331945,0.2,0.13200000000000001,12,"","1a"]
[1,2,1,1,"Acker",null,"Dinkel",1.9186046511627906,0.93023255813953487,0.40603778181559802,0.93023255813953487,0.77197722667181312,0.23255813953488372,0.14883720930232561,86,1.65,0.8,0.34919249236141425,0.8,0.66390041493775931,0.2,0.128,12,"","1a"]
[1,2,1,1,"Acker",null,"Emmer/Einkorn",2.1046511627906979,0.87209302325581395,0.38066042045212312,0.63953488372093026,0.53073434333687164,0.23255813953488372,0.16837209302325581,86,1.81,0.75,0.32736796158882586,0.55000000000000004,0.45643153526970953,0.2,0.14480000000000001,12,"","1a"]
[1,2,1,1,"Acker",null,"Hartweizen (Durum)",2.1046511627906979,0.93023255813953487,0.40603778181559802,0.69767441860465118,0.57898292000385987,0.23255813953488372,0.16837209302325581,86,1.81,0.8,0.34919249236141425,0.6,0.49792531120331945,0.2,0.14480000000000001,12,{"$f":"+IF(B27=1,\"ja\",\"\")","v":""},"1a"]
[1,2,1,1,"Acker",null,"Buchweizen",2.7093023255813953,0.7558139534883721,0.32990569772517336,0.58139534883720934,0.48248576666988319,0.34883720930232559,0.15813953488372093,86,2.33,0.65,0.28371890004364908,0.5,0.41493775933609955,0.3,0.13600000000000001,16.933139534883722,{"$f":"+IF(B28=1,\"ja\",\"\")","v":""},"1a"]
[null,0,16,1,"Acker","Körnermais, sonstige Körnernutzung"," ++++Körnermais, sonstige Körnernutzung+++ ",null,null,null,null,null,null,null,null,null,null,null,null,null,null,null,null,{"$f":"+IF(B29=1,\"ja\",\"\")","v":""},"1a"]
[1,2,16,1,"Acker",null,"Körnermais ",1.6046511627906976,0.93023255813953487,0.40697674418604651,0.58139534883720934,0.48248576666988319,0.23255813953488372,0.15348837209302327,86,1.38,0.8,0.35,0.5,0.41493775933609955,0.2,0.13200000000000001,10,"","1a"]
[2,1,16,16,"Acker",null,"Körnermaisstroh",1.0465116279069768,0.23255813953488372,0.10465116279069767,2.3255813953488373,1.9299430666795327,0.46511627906976744,8.3720930232558138E-2,86,0.9,0.2,0.09,2,1.6597510373443982,0.4,7.2000000000000008E-2,null,"ja","1a"]
[1,2,16,1,"Acker",null,"Hirse",2.7209302325581395,1.0348837209302326,0.45171703226985277,0.58139534883720934,0.48248576666988319,0.34883720930232559,0.15813953488372093,86,2.34,0.89,0.38847664775207336,0.5,0.41493775933609955,0.3,0.13600000000000001,17.005813953488371,"","1a"]
[1,2,16,1,"Acker",null,"Amarant",2.7209302325581395,1.0348837209302326,0.45171703226985277,0.58139534883720934,0.48248576666988319,0.34883720930232559,0.15813953488372093,86,2.34,0.89,0.38847664775207336,0.5,0.41493775933609955,0.3,0.13600000000000001,17.005813953488371,"","1a"]
[1,2,16,1,"Acker",null,"Quinoa",2.6046511627906979,1.0930232558139534,0.47709439363332756,1.1046511627906976,0.91672295667277803,0.37209302325581395,0.16279069767441862,86,2.2400000000000002,0.94,0.41030117852466169,0.95,0.78838174273858908,0.32,0.14000000000000001,16.279069767441865,"","1a"]
[null,0,2,2,"Acker","Körnerleguminosen"," +++Körnerleguminosen+++",null,null,null,null,null,null,null,null,null,null,null,null,null," ",null,null,null,"1a"]
[1,2,2,2,"Acker",null,"Ackerbohnen",4.7674418604651159,1.3953488372093024,0.60465116279069775,1.6279069767441861,1.3509601466756729,0.23255813953488372,0.20465116279069767,86,4.0999999999999996,1.2,0.52,1.4,1.1618257261410787,0.2,0.17599999999999999,29.8,{"$f":"+IF(B36=1,\"ja\",\"\")","v":""},"1a"]
[1,2,2,2,"Acker",null,"Erbsen",4.1860465116279073,1.2790697674418605,0.55813953488372092,1.6279069767441861,1.3509601466756729,0.23255813953488372,0.20465116279069767,86,3.6,1.1000000000000001,0.48,1.4,1.1618257261410787,0.2,0.17599999999999999,26,"","1a"]
[1,2,2,2,"Acker",null,"Wicken",4.1860465116279073,1.2790697674418605,0.55830194999644722,1.6279069767441861,1.3509601466756729,0.23255813953488372,0.20465116279069767,86,3.6,1.1000000000000001,0.4801396769969446,1.4,1.1618257261410787,0.2,0.17599999999999999,26,"","1a"]
[1,2,2,2,"Acker",null,"Lupinen blau",5.2093023255813957,1.1860465116279071,0.52325581395348841,1.1511627906976745,0.95532181800636884,0.23255813953488372,0.20465116279069767,86,4.4800000000000004,1.02,0.45,0.99,0.82157676348547715,0.2,0.17599999999999999,33,"","1a"]
[1,2,2,2,"Acker",null,"Linsen",4.16,1.2790697674418605,0.55830194999644722,1.6279069767441861,1.3509601466756729,0.23255813953488372,0.20465116279069767,86,3.5775999999999999,1.1000000000000001,0.4801396769969446,1.4,1.1618257261410787,0.2,0.17599999999999999,26,"","1a"]
[1,2,2,2,"Acker",null,"Sojabohnen",5.1162790697674421,1.7441860465116279,0.76744186046511631,1.9767441860465116,1.6404516066776029,0.58139534883720934,0.43488372093023259,86,4.4000000000000004,1.5,0.66,1.7,1.4107883817427385,0.5,0.374,32,"","1a"]
[null,0,3,3,"Acker","Ölfrüchte und Faserpflanzen"," +++Ölfrüchte und Faserpflanzen+++",null,null,null,null,null,null,null,null,null,null,null,null,null,null,null,null,null,"1a"]
[1,2,3,3,"Acker",null,"Raps",3.6813186813186816,1.9780219780219779,0.85714285714285721,1.098901098901099,0.91195111941999896,0.5494505494505495,0.45098901098901101,91,3.35,1.8,0.78,1,0.82987551867219911,0.5,0.41039999999999999,23,{"$f":"+IF(B43=1,\"ja\",\"\")","v":""},"1a"]
[1,2,3,3,"Acker",null,"Rübsen",3.6813186813186816,1.9780219780219779,0.86338803056393632,1.098901098901099,0.91195111941999896,0.5494505494505495,0.45098901098901101,91,3.35,1.8,0.78568310781318207,1,0.82987551867219911,0.5,0.41039999999999999,23,"","1a"]
[1,2,3,3,"Acker",null,"Sonnenblumen ",3.197802197802198,1.7582417582417582,0.76923076923076916,2.6373626373626373,2.1886826866079976,0.65934065934065933,0.29010989010989013,91,2.91,1.6,0.7,2.4,1.9917012448132778,0.6,0.26400000000000001,20,"","1a"]
[1,2,3,3,"Acker",null,"Körnersenf",5.5824175824175821,1.945054945054945,0.84615384615384615,1.0219780219780219,0.84615384615384615,0.32967032967032966,0.4505494505494505,91,5.08,1.77,0.77,0.93,0.77,0.3,0.41,35,null,"1a"]
[1,2,3,3,"Acker",null,"Öllein, Faserflachs ",3.8461538461538463,1.3186813186813187,0.5714285714285714,1.098901098901099,0.91195111941999896,0.87912087912087911,0.2,91,3.5,1.2,0.52,1,0.82987551867219911,0.8,0.182,24,"","1a"]
[1,2,3,3,"Acker",null,"Leindotter",3.8461538461538463,1.3186813186813187,0.57559202037595758,1.098901098901099,0.91195111941999896,0.87912087912087911,0.2,91,3.5,1.2,0.52378873854212138,1,0.82987551867219911,0.8,0.182,24,"","1a"]
[3,1,4,3,"Acker",null,"Flachs (Faserlein)",null,null,null,null,null,null,null,86,1,0.64,0.28000000000000003,1.71,1.42,0.1,0.08,null,null,"1a"]
[3,1,4,3,"Acker",null,"Hanf",1,0.75,0.32500000000000001,2,1.6597510373443984,0.89999999999999991,0.08,40,0.4,0.3,0.13,0.8,0.66390041493775931,0.36,3.2000000000000001E-2,null,null,"1a"]
[null,0,5,4,"Acker","Hackfrüchte"," +++Hackfrüchte+++",null,null,null,null,null,null,null,null,null,null,null,null,null," ",null,null,null,"1a"]
[1,2,5,4,"Acker",null,"Kartoffel ",1.5909090909090908,0.63636363636363635,0.27272727272727271,2.7272727272727271,2.2632968691059978,0.18181818181818182,0.2,22,0.35,0.14000000000000001,0.06,0.6,0.49792531120331945,0.04,4.3999999999999997E-2,null,{"$f":"+IF(B52=1,\"ja\",\"\")","v":""},"1a"]
[1,2,5,4,"Acker",null,"Zuckerrüben",0.78260869565217384,0.43478260869565216,0.17391304347826086,1.0869565217391304,0.90203860725239038,0.34782608695652173,0.2,23,0.18,0.1,0.04,0.25,0.20746887966804978,0.08,4.5999999999999999E-2,null,"","1a"]
[2,1,5,7,"Acker",null,"Zuckerrübenblatt",2.2222222222222223,0.61111111111111116,0.27777777777777779,3.9444444444444442,3.2733978792070073,0.55555555555555558,0.46222222222222231,18,0.4,0.11,0.05,0.71,0.58921161825726132,0.1,8.320000000000001E-2,null,"ja","1a"]
[1,2,5,4,"Acker",null,"Futter-, Runkelrüben",1.2,0.6,0.26666666666666666,3.3333333333333335,2.7662517289073305,0.33333333333333337,0.19466666666666665,15,0.18,0.09,0.04,0.5,0.41493775933609955,0.05,2.9199999999999997E-2,null,"","1a"]
[1,2,5,4,"Acker",null,"Kohl-, Steckrüben",1.1666666666666667,0.58333333333333337,0.25,3.75,3.1120331950207469,0.41666666666666669,0.18333333333333332,12,0.14000000000000001,7.0000000000000007E-2,0.03,0.45,0.37344398340248963,0.05,2.1999999999999999E-2," ","","1a"]
[null,0,6,5,"Acker","Mehrschnittiger Feldfutterbau "," +++Mehrschnittiger Feldfutterbau+++ ",null,null,null,null,null,null,null,null,null,null,null,null,null,null,null,null,null,"1a"]
[3,1,6,5,"Acker",null,"Esparsette",3.25,0.70000000000000007,0.30554343081623753,3.25,2.697095435684647,0.35000000000000003,0.33,20,0.65,0.14000000000000001,6.1108686163247501E-2,0.65,0.53941908713692943,7.0000000000000007E-2,6.6000000000000003E-2,20.3,{"$f":"+IF(B58=1,\"ja\",\"\")","v":"ja"},"1a"]
[3,1,6,5,"Acker",null,"Ackergras 3-4 Schnitte/Jahr ",2.6,0.8,0.34919249236141425,3.25,2.697095435684647,0.4,0.3,20,0.52,0.16,6.9838498472282851E-2,0.65,0.53941908713692943,0.08,0.06,16.2,"ja","1a"]
[3,1,6,5,"Acker",null,"Ackergras 5 Schnitte/Jahr",2.6500000000000004,0.8,0.35000000000000003,3.5999999999999996,2.9875518672199166,0.4,0.3,20,0.53,0.16,7.0000000000000007E-2,0.72,0.59751037344398339,0.08,0.06,16.600000000000001,"ja","1a"]
[3,1,6,5,"Acker",null,"Kleegras (Kleeanteil 30 %)",2.8000000000000003,0.75,0.32736796158882586,3.35,2.7800829875518676,0.4,0.35000000000000003,20,0.56000000000000005,0.15,6.5473592317765172E-2,0.67,0.55601659751037347,0.08,7.0000000000000007E-2,17.600000000000001,"ja","1a"]
[3,1,6,5,"Acker",null,"Kleegras (Kleeanteil 50 %)",2.9,0.70000000000000007,0.3,3.25,2.697095435684647,0.44999999999999996,0.35000000000000003,20,0.57999999999999996,0.14000000000000001,0.06,0.65,0.53941908713692943,0.09,7.0000000000000007E-2,18.2,"ja","1a"]
[3,1,6,5,"Acker",null,"Kleegras (Kleeanteil 70 %)",3.05,0.70000000000000007,0.30554343081623753,3.25,2.697095435684647,0.44999999999999996,0.35000000000000003,20,0.61,0.14000000000000001,6.1108686163247501E-2,0.65,0.53941908713692943,0.09,7.0000000000000007E-2,19.2,"ja","1a"]
[3,1,6,5,"Acker",null,"Luzernegras (Luz.anteil 30 %)",2.8000000000000003,0.75,0.32736796158882586,3.25,2.697095435684647,0.4,0.35000000000000003,20,0.56000000000000005,0.15,6.5473592317765172E-2,0.65,0.53941908713692943,0.08,7.0000000000000007E-2,17.600000000000001,"ja","1a"]
[3,1,6,5,"Acker",null,"Luzernegras (Luz.anteil 50 %)",2.9,0.75,0.35000000000000003,3.25,2.697095435684647,0.44999999999999996,0.35000000000000003,20,0.57999999999999996,0.15,7.0000000000000007E-2,0.65,0.53941908713692943,0.09,7.0000000000000007E-2,18.2,"ja","1a"]
[3,1,6,5,"Acker",null,"Luzernegras (Luz.anteil 70 %)",3.05,0.70000000000000007,0.30554343081623753,{"$f":"+S66/$O66*100","v":3.25},2.697095435684647,0.44999999999999996,0.35000000000000003,20,0.61,0.14000000000000001,6.1108686163247501E-2,0.65,0.53941908713692943,0.09,7.0000000000000007E-2,19.2,"ja","1a"]
[3,1,6,5,"Acker",null,"Rotklee",{"$f":"+P67/$O67*100","v":3.25},0.65,0.65,3.25,2.697095435684647,0.5,0.35000000000000003,20,0.65,0.13,0.13,0.65,0.53941908713692943,0.1,7.0000000000000007E-2,20.46,"ja","1a"]
[3,1,6,5,"Acker",null,"Luzerne",3.25,0.70000000000000007,0.3,3.25,2.697095435684647,0.44999999999999996,0.35000000000000003,20,0.65,0.14000000000000001,0.06,0.65,0.53941908713692943,0.09,7.0000000000000007E-2,20.46,"ja","1a"]
[null,0,7,5,"Acker","Futterpflanzen "," +++Futterpflanzen+++",null,null,null,null,null,null,null,null,null,null,null,null,null," ",null,null,null,"1a"]
[3,1,7,5,"Acker",null,"Silomais (28 % TM)",1.3571428571428572,0.5714285714285714,0.25,1.6071428571428574,1.3337285121517486,0.3214285714285714,8.5714285714285715E-2,28,0.38,0.16,7.0000000000000007E-2,0.45,0.37344398340248963,0.09,2.4E-2,null,{"$f":"+IF(B70=1,\"ja\",\"\")","v":"ja"},"1a"]
[3,1,7,5,"Acker",null,"Silomais (32 % TM)",1.34375,0.53125,0.23188563945875165,1.59375,1.3226141078838174,0.3125,8.1250000000000003E-2,32,0.43,0.17,7.4203404626800529E-2,0.51,0.42323651452282157,0.1,2.6000000000000002E-2,null,"ja","1a"]
[3,1,7,5,"Acker",null,"Silomais (35 % TM)",1.34375,0.51428571428571423,0.22857142857142859,1.59375,{"$f":"+T72/$O72*100","v":1.3226141078838174},0.3125,8.5714285714285715E-2,35,0.47031249999999997,0.18,0.08,0.55781250000000004,0.46291493775933612,0.109375,0.03," ","ja","1a"]
[3,2,7,5,"Acker",null,"CCM",1.6800000000000002,0.67999999999999994,0.3,0.6,{"$f":"+T73/$O73*100","v":0.49792531120331945},{"$f":"+U73/$O73*100","v":0.16666666666666669},0.15,60,{"$f":"+H73/100*$O73","v":1.0080000000000002},{"$f":"+I73/100*$O73","v":0.40799999999999997},0.18,0.36,{"$f":"+S73/1.205","v":0.29875518672199169},0.1,0.09,10.5,"","1a"]
[3,2,7,5,"Acker",null,"Lieschkolbensilage",1.52,0.64,0.2793539938891314,0.72,0.59751037344398339,0.2,0.15,50,0.76,0.32,0.1396769969445657,0.36,0.29875518672199169,0.1,7.4999999999999997E-2,null,"","1a"]
[3,1,7,5,"Acker",null,"GPS Getreide",1.6,0.65999999999999992,0.28999999999999998,1.342857142857143,1.1144042679312387,0.2857142857142857,0.17142857142857146,35,{"$f":"+H75/100*$O75","v":0.56000000000000005},{"$f":"+I75/100*$O75","v":0.23099999999999996},0.1,0.47,0.39004149377593356,0.1,6.0000000000000012E-2,10,"ja","1a"]
[3,1,7,5,"Acker",null,"GPS Lupinen",1.6,0.65714285714285714,0.28683669015401886,1.342857142857143,1.1144042679312387,0.2857142857142857,0.19999999999999996,35,0.56000000000000005,0.23,0.1003928415539066,0.47,0.39004149377593356,0.1,6.9999999999999993E-2,null,"ja","1a"]
[3,1,7,5,"Acker",null,"GPS Erbsen/Ackerbohne",1.6,0.65714285714285714,0.28683669015401886,1.342857142857143,1.1144042679312387,0.2857142857142857,0.19999999999999996,35,0.56000000000000005,0.23,0.1003928415539066,0.47,0.39004149377593356,0.1,6.9999999999999993E-2,null,"ja","1a"]
[3,1,7,5,"Acker",null,"GPS Sonnenblumen",1.34,0.55999999999999994,0.25,1.59375,1.3226141078838174,0.3125,8.5714285714285715E-2,35,{"$f":"+H78/100*$O78","v":0.46900000000000003},{"$f":"+I78/100*$O78","v":0.19599999999999998},8.5934089917066789E-2,0.55781250000000004,0.46291493775933612,0.109375,0.03,8.4,"ja","1a"]
[3,1,7,5,"Acker",null,"GPS Rübsen ",{"$f":"+P79/$O79*100","v":1.6},0.65714285714285714,0.28683669015401886,1.342857142857143,1.1144042679312387,0.2857142857142857,0.17142857142857146,35,0.56000000000000005,0.23,0.1003928415539066,0.47,0.39004149377593356,0.1,6.0000000000000012E-2,null,"ja","1a"]
[3,1,7,5,"Acker",null,"GPS Wicken",1.6,0.65714285714285714,0.2857142857142857,1.342857142857143,1.1142857142857143,0.2857142857142857,0.2,35,0.56000000000000005,0.23,0.1,0.47,0.39,0.1,7.0000000000000007E-2,null,"ja","1a"]
[3,1,7,5,"Acker",null,"GPS Raps ",1.6,0.65714285714285714,0.28683669015401886,1.342857142857143,1.1144042679312387,0.2857142857142857,0.17142857142857146,35,0.56000000000000005,0.23,0.1003928415539066,0.47,0.39004149377593356,0.1,6.0000000000000012E-2,null,"ja","1a"]
[null,0,8,7,"Acker","Energiepflanzen"," +++Energiepflanzen+++",null,null,null,null,null,null,null,null,null,null,null,null,null,null,null,null,null,"1a"]
[3,1,8,7,"Acker",null,"Silphium, Silphie",1,0.5,0.21824530772588396,2.2857142857142856,1.896858328393598,0.64285714285714279,0.10714285714285715,28,0.28000000000000003,0.14000000000000001,6.1108686163247501E-2,0.64,0.53112033195020747,0.18,0.03,null,{"$f":"+IF(B83=1,\"ja\",\"\")","v":"ja"},"1a"]
[3,1,8,7,"Acker",null,"Sorgumhirse",1.4642857142857142,0.64285714285714279,0.2806011099332793,1.7142857142857144,1.4226437462951986,0.14285714285714285,7.4999999999999997E-2,28,0.41,0.18,7.8568310781318207E-2,0.48,0.39834024896265557,0.04,2.1000000000000001E-2," ","ja","1a"]
[3,1,8,7,"Acker",null,"Sida (Virginiamalve)",1.2142857142857144,0.60714285714285721,0.26501215938143047,2.1071428571428572,1.748666271487848,0.3214285714285714,2.5,28,0.34,0.17,7.4203404626800529E-2,0.59,0.48962655601659744,0.09,0.7,null,"ja","1a"]
[3,1,8,7,"Acker",null,"Igniscum ",1.107142857142857,0.3928571428571429,0.17147845607033735,1.4642857142857142,1.2151748666271487,0.3928571428571429,0.14285714285714285,28,0.31,0.11,4.801396769969446E-2,0.41,0.34024896265560162,0.11,0.04,null,"ja","1a"]
[3,1,8,7,"Acker",null,"Riesenweizengras (Szarvasi)",0.96428571428571441,0.3928571428571429,0.17147845607033735,1.892857142857143,1.5708358032009484,0.14285714285714285,0.14285714285714285,28,0.27,0.11,4.801396769969446E-2,0.53,0.43983402489626555,0.04,0.04,null,"ja","1a"]
[3,1,8,7,"Acker",null,"Chinaschilf (Miscanthus)",0.1875,0.15,6.25E-2,0.52499999999999991,0.43568464730290457,7.4999999999999997E-2,0.05,80,0.15,0.12,0.05,0.42,0.34854771784232363,0.06,0.04,null,"ja","1a"]
[3,1,8,7,"Acker",null,"Switchgras",1.2142857142857144,0.5714285714285714,0.25,2.1785714285714288,1.8214285714285714,0.3928571428571429,0.17857142857142858,28,0.34,0.16,7.0000000000000007E-2,0.61,0.51,0.11,0.05,null,"ja","1a"]
[3,1,8,7,"Acker",null,"Rohrglanzgras",1.4642857142857142,0.5357142857142857,0.23383425827773274,2.6071428571428572,2.1636040308239477,0.17857142857142858,0.17857142857142858,28,0.41,0.15,6.5473592317765172E-2,0.73,0.60580912863070535,0.05,0.05,null,"ja","1a"]
[3,1,8,7,"Acker",null,"GPS Hirse",1.25,0.5714285714285714,0.24942320882958163,1.7142857142857144,1.4226437462951986,0.14285714285714285,8.5714285714285715E-2,28,0.35,0.16,6.9838498472282851E-2,0.48,0.39834024896265557,0.04,2.4E-2," ","ja","1a"]
[3,1,8,7,"Acker",null,"GPS Amarant ",1.25,0.5714285714285714,0.24942320882958163,1.7142857142857144,1.4226437462951986,0.14285714285714285,8.5714285714285715E-2,28,0.35,0.16,6.9838498472282851E-2,0.48,0.39834024896265557,0.04,2.4E-2,null,"ja","1a"]
[3,1,8,7,"Acker",null,"GPS Buchweizen",1.25,0.5714285714285714,0.24942320882958163,1.7142857142857144,1.4226437462951986,0.14285714285714285,8.5714285714285715E-2,28,0.35,0.16,6.9838498472282851E-2,0.48,0.39834024896265557,0.04,2.4E-2,null,"ja","1a"]
[3,1,8,7,"Acker",null,"GPS Quinoa ",1.25,0.5714285714285714,0.24942320882958163,1.7142857142857144,1.4226437462951986,0.14285714285714285,8.5714285714285715E-2,28,0.35,0.16,6.9838498472282851E-2,0.48,0.39834024896265557,0.04,2.4E-2,null,"ja","1a"]
[null,null,null,null,null,"Vermehrungspflanzen"," +++Vermehrungspflanzen+++",null,null,null,null,null,null,null,null,null,null,null,null,null,null,null,null,null,"1a"]
[1,2,9,8,"Acker",null,"Grassamenvermehrung",2.558139534883721,0.81395348837209303,0.36046511627906974,0.58139534883720934,0.48248576666988319,0.19767441860465118,0.20465116279069767,86,2.2000000000000002,0.7,0.31,0.5,0.41493775933609955,0.17,0.17600000000000002,null,"","1a"]
[1,2,9,8,"Acker",null,"Kleesamenvermehrung",6.0439560439560438,1.6043956043956045,0.70329670329670324,1.3736263736263736,1.1399388992749988,0.2967032967032967,0.48351648351648352,91,5.5,1.46,0.64,1.25,1.0373443983402488,0.27,0.44,null,"","1a"]
[1,2,9,8,"Acker",null,"Luzernesamenvermehrung",6.0439560439560438,1.6043956043956045,0.70329670329670324,1.3736263736263736,1.1399388992749988,0.2967032967032967,0.48351648351648352,91,5.5,1.46,0.64,1.25,1.0373443983402488,0.27,0.44,null,"","1a"]
[1,2,9,8,"Acker",null,"Phaceliasamenvermehrung",2.4175824175824179,0.76923076923076916,0.33576201188597521,0.5494505494505495,0.45597555970999948,0.18681318681318684,0.19340659340659341,91,2.2000000000000002,0.7,0.30554343081623742,0.5,0.41493775933609955,0.17,0.17600000000000002,null,"","1a"]
[1,2,9,8,"Acker",null,"Wildkräutervermehr. (Leguminose)",3.0769230769230766,1.6483516483516485,0.7142857142857143,1.9780219780219779,1.6373626373626375,0.49450549450549447,0.19780219780219779,91,2.8,1.5,0.65,1.8,1.49,0.45,0.18,null,null,"1a"]
[1,2,9,8,"Acker",null,"Wildkräuterverm. (Nichtleg.)",3.0769230769230766,1.6483516483516485,0.719490025469947,1.9780219780219779,1.6415120149559985,0.49450549450549447,0.19340659340659341,91,2.8,1.5,0.65473592317765172,1.8,1.4937759336099585,0.45,0.17600000000000002,null,null,"1a"]
[null,0,10,9,"Acker","Dauerkulturen"," +++Dauerkulturen+++",null,null,null,null,null,null,null,null,null,null,null,null,null,null,null,null,null,"1a"]
[1,2,10,9,"Acker",null,"Erdbeeren",null,null,null,null,null,null,null,null,0.17,0.05,0.02,0.28000000000000003,0.23236514522821577,0.03,1.3600000000000001E-2,null,{"$f":"+IF(B103=1,\"ja\",\"\")","v":""},"1a"]
[1,2,10,9,"Acker",null,"Himbeeren",null,null,null,null,null,null,null,null,0.2,0.04,1.7459624618070713E-2,0.2,0.16597510373443983,0.05,0.02,null,"","1a"]
[1,2,10,9,"Acker",null,"Johannis-/ Heidel-/ Holunderbeeren",null,null,null,null,null,null,null,null,0.2,0.1,4.3649061545176782E-2,0.3,0.24896265560165973,0.03,0.02,null,"","1a"]
[1,2,10,9,"Acker",null,"Kernobst",null,null,null,null,null,null,null,null,0.11,0.03,1.3094718463553033E-2,0.19,0.15767634854771784,0.01,8.8000000000000005E-3,null,"","1a"]
[1,2,10,9,"Acker",null,"Steinobst",null,null,null,null,null,null,null,null,0.25,0.06,2.6189436927106065E-2,0.4,0.33195020746887965,0.02,0.02,null,"","1a"]
[1,2,10,9,"Acker",null,"Streuobst",null,null,null,null,null,null,null,null,0.11,0.03,1.3094718463553033E-2,0.19,0.15767634854771784,0.01,8.8000000000000005E-3,null,"","1a"]
[1,2,10,9,"Acker",null,"Reben (Trauben)",null,null,null,null,null,null,null,null,0.25,0.1,4.3649061545176782E-2,0.4,0.33195020746887965,0.08,0.02,null,"","1a"]
[3,2,10,9,"Acker",null,"Rebschulen",null,null,null,null,null,null,null,null,0.3,0.1,4.3649061545176782E-2,0.3,0.24896265560165973,0.05,2.4E-2,null,"","1a"]
[1,2,10,9,"Acker",null,"Haselnüsse",null,null,null,null,null,null,null,null,1.9,0.7,0.30554343081623742,0.6,0.49792531120331945,0.2,0.152,null,"","1a"]
[1,2,10,9,"Acker",null,"Walnüsse",null,null,null,null,null,null,null,null,1.9,0.7,0.30554343081623742,0.6,0.49792531120331945,0.2,0.152,null,"","1a"]
[1,2,10,9,"Acker",null,"Hopfen (10 % Wasser)",3.3333333333333335,1.1111111111111112,0.48498957272418647,2.8888888888888893,2.3974181650530197,0.55555555555555558,0.26666666666666666,90,3,1,0.43649061545176782,2.6,2.1576763485477177,0.5,0.24,null,"","1a"]
[2,2,10,9,"Acker",null,"Hopfen Rebenhäcksel",2.2222222222222223,0.48148148148148151,0.21016214818048079,2.1851851851851851,1.8134316889503608,0.77777777777777779,3.7037037037037035E-2,27,0.6,0.13,5.6743780008729816E-2,0.59,0.48962655601659744,0.21,0.01,null,"","1a"]
[1,2,5,9,"Acker",null,"Topinambur ",0.72727272727272729,0.40909090909090906,0.17856434268481411,1.8181818181818183,1.5088645794039985,9.0909090909090912E-2,5.8181818181818182E-2,22,0.16,0.09,3.9284155390659103E-2,0.4,0.33195020746887965,0.02,1.2800000000000001E-2,null,"","1a"]
[3,2,10,9,"Acker",null,"Tabak (Burley dachtrocken)",null,null,null,null,null,null,null,null,4,0.7,0.30554343081623742,5.7,4.7302904564315353,0.4,0.32,null,"","1a"]
[3,2,10,9,"Acker",null,"Trüffel",null,null,null,null,null,null,null,null,1.9,0.7,0.30554343081623742,0.6,0.49792531120331945,0.2,0.152,null,"","1a"]
[3,2,10,9,"Acker",null,"Christbaumkulturen",null,null,null,null,null,null,null,null,0.5,0.3,0.13094718463553034,0.5,0.41493775933609955,0.1,0.04,null,"","1a"]
[3,2,10,9,"Acker",null,"Baumschule",null,null,null,null,null,null,null,null,0.3,0.1,4.3649061545176782E-2,0.3,0.24896265560165973,0.05,2.4E-2,null,"","1a"]
[3,2,10,9,"Acker",null,"Kurzumtriebsplantagen",null,null,null,null,null,null,null,null,0.3,0.1,4.3649061545176782E-2,0.3,0.24896265560165973,0.05,2.4E-2,null,"","1a"]
[3,2,15,12,"Acker",null,"Rollrasen",null,null,null,null,null,null,null,null,0.25,0.12,5.2378873854212131E-2,0.2,0.16597510373443983,0.05,7.0000000000000007E-2,null,"","1a"]
[3,2,15,12,"Acker",null,"Zierpflanzen (Gladiolen, Lilien...)",null,null,null,null,null,null,null,null,0.5,0.2,8.7298123090353563E-2,0.7,0.58091286307053935,0.1,0.04,null,"","1a"]
[null,null,null,null,null,"Zweitfrucht (2. Hauptfrucht) und Zwischenfrucht"," +++Zweitfrucht (2. Hauptfrucht)+++ ",null,null,null,null,null,null,null,null,null,null,null,null,null,null,null,null,null,"1b"]
[3,1,6,5,"Acker",null,"Weidelgras ",{"$f":"+P124/$O124*100","v":2.6500000000000004},{"$f":"+Q124/$O124*100","v":0.8},0.34919249236141425,3.5999999999999996,2.9875518672199166,0.4,0.3,20,0.53,0.16,6.9838498472282851E-2,0.72,0.59751037344398339,0.08,0.06,null,"ja","1b"]
[3,1,6,5,"Acker",null,"Kleegras mit 30 % Leguminosen",{"$f":"+P125/$O125*100","v":2.8000000000000003},0.75,0.32736796158882586,3.35,2.7800829875518676,0.4,0.3,20,0.56000000000000005,0.15,6.5473592317765172E-2,0.67,0.55601659751037347,0.08,0.06,null,"ja","1b"]
[3,1,6,5,"Acker",null,"Kleegras mit 50 % Leguminosen",2.9,0.70000000000000007,0.3,3.25,2.697095435684647,0.44999999999999996,0.35000000000000003,20,0.57999999999999996,0.14000000000000001,0.06,0.65,0.53941908713692943,0.09,7.0000000000000007E-2,null,"ja","1b"]
[3,1,6,5,"Acker",null,"Kleegras mit 70 % Leguminosen",3.05,0.70000000000000007,0.30554343081623753,3.25,2.697095435684647,0.44999999999999996,0.4,20,0.61,0.14000000000000001,6.1108686163247501E-2,0.65,0.53941908713692943,0.09,0.08,null,"ja","1b"]
[3,1,6,5,"Acker",null,"Alexandrinerklee",2.2999999999999998,0.70000000000000007,0.30554343081623753,2.5,2.0746887966804977,0.25,0.13999999999999999,20,0.46,0.14000000000000001,6.1108686163247501E-2,0.5,0.41493775933609955,0.05,2.7999999999999997E-2,null,"ja","1b"]
[3,1,7,5,"Acker",null,"Serradella kleinkörnig",2.2999999999999998,0.70000000000000007,0.30554343081623753,2.5,2.0746887966804977,0.25,0.13999999999999999,20,0.46,0.14000000000000001,6.1108686163247501E-2,0.5,0.41493775933609955,0.05,2.7999999999999997E-2,null,"ja","1b"]
[3,1,7,5,"Acker",null,"GPS Futtererbsen/Ackerbohnen",2.2999999999999998,0.70000000000000007,0.30554343081623753,2.5,2.0746887966804977,0.25,0.13999999999999999,20,0.46,0.14000000000000001,6.1108686163247501E-2,0.5,0.41493775933609955,0.05,2.7999999999999997E-2,null,"ja","1b"]
[3,1,7,5,"Acker",null,"GPS Sommerwicken",2.2999999999999998,0.70000000000000007,0.30554343081623753,2.5,2.0746887966804977,0.25,0.13999999999999999,20,0.46,0.14000000000000001,6.1108686163247501E-2,0.5,0.41493775933609955,0.05,2.7999999999999997E-2,null,"ja","1b"]
[3,1,7,5,"Acker",null,"GPS Sommerraps",2.2999999999999998,0.70000000000000007,0.30554343081623753,2.5,2.0746887966804977,0.25,0.13999999999999999,20,0.46,0.14000000000000001,6.1108686163247501E-2,0.5,0.41493775933609955,0.05,2.7999999999999997E-2,null,"ja","1b"]
[3,1,7,5,"Acker",null,"GPS Winterraps",2.2999999999999998,0.70000000000000007,0.30554343081623753,2.5,2.0746887966804977,0.25,0.13999999999999999,20,0.46,0.14000000000000001,6.1108686163247501E-2,0.5,0.41493775933609955,0.05,2.7999999999999997E-2,null,"ja","1b"]
[3,1,7,5,"Acker",null,"GPS Winterrübsen",2.2999999999999998,0.70000000000000007,0.30554343081623753,2.5,2.0746887966804977,0.25,0.13999999999999999,20,0.46,0.14000000000000001,6.1108686163247501E-2,0.5,0.41493775933609955,0.05,2.7999999999999997E-2,null,"ja","1b"]
[3,1,7,5,"Acker",null,"GPS Sommerrübsen",2.2999999999999998,0.70000000000000007,0.30554343081623753,2.5,2.0746887966804977,0.25,0.13999999999999999,20,0.46,0.14000000000000001,6.1108686163247501E-2,0.5,0.41493775933609955,0.05,2.7999999999999997E-2,null,"ja","1b"]
[3,1,7,5,"Acker",null,"GPS Ölrettich",2.2999999999999998,0.70000000000000007,0.30554343081623753,2.5,2.0746887966804977,0.25,0.13999999999999999,20,0.46,0.14000000000000001,6.1108686163247501E-2,0.5,0.41493775933609955,0.05,2.7999999999999997E-2,null,"ja","1b"]
[3,1,7,5,"Acker",null,"GPS Senf weiß/gelb",2.2999999999999998,0.70000000000000007,0.30554343081623753,2.5,2.0746887966804977,0.25,0.13999999999999999,20,0.46,0.14000000000000001,6.1108686163247501E-2,0.5,0.41493775933609955,0.05,2.7999999999999997E-2,null,"ja","1b"]
[3,1,7,5,"Acker",null,"GPS Phacelia",2.2999999999999998,0.70000000000000007,0.30554343081623753,2.5,2.0746887966804977,0.25,0.13999999999999999,20,0.46,0.14000000000000001,6.1108686163247501E-2,0.5,0.41493775933609955,0.05,2.7999999999999997E-2,null,"ja","1b"]
[3,1,7,5,"Acker",null,"GPS Sonnenblumen ",1.3571428571428572,0.5714285714285714,0.24942320882958163,1.6071428571428574,1.3337285121517486,0.3214285714285714,7.1428571428571425E-2,28,0.38,0.16,6.9838498472282851E-2,0.45,0.37344398340248963,0.09,0.02,null,"ja","1b"]
[3,1,7,5,"Acker",null,"GPS Gemenge mit 30 % Leguminosen",2.2999999999999998,0.70000000000000007,0.30554343081623753,2.5,2.0746887966804977,0.25,0.13999999999999999,20,0.46,0.14000000000000001,6.1108686163247501E-2,0.5,0.41493775933609955,0.05,2.7999999999999997E-2,null,"ja","1b"]
[3,1,7,5,"Acker",null,"GPS Gemenge mit 50 % Leguminosen",2.2999999999999998,0.70000000000000007,0.30554343081623753,2.5,2.0746887966804977,0.25,0.13999999999999999,20,0.46,0.14000000000000001,6.1108686163247501E-2,0.5,0.41493775933609955,0.05,2.7999999999999997E-2,null,"ja","1b"]
[3,1,7,5,"Acker",null,"GPS Gemenge mit 70 % Leguminosen ",2.2999999999999998,0.70000000000000007,0.30554343081623753,2.5,2.0746887966804977,0.25,0.13999999999999999,20,0.46,0.14000000000000001,6.1108686163247501E-2,0.5,0.41493775933609955,0.05,2.7999999999999997E-2,null,"ja","1b"]
[3,1,7,5,"Acker",null,"GPS Winterroggen/Grünroggen",1.6,0.66666666666666674,0.29099374363451191,1.3333333333333335,1.1065006915629321,0.3,0.16666666666666669,30,0.48,0.2,8.7298123090353563E-2,0.4,0.33195020746887965,0.09,0.05,null,"ja","1b"]
[3,1,7,5,"Acker",null,"Silomais",1.3571428571428572,0.5714285714285714,0.24942320882958163,1.6071428571428574,1.3337285121517486,0.3214285714285714,7.1428571428571425E-2,28,0.38,0.16,6.9838498472282851E-2,0.45,0.37344398340248963,0.09,0.02,null,"ja","1b"]
[3,1,8,5,"Acker",null,"GPS Sorghumhirse",1.4642857142857142,0.64285714285714279,0.2806011099332793,1.7142857142857144,1.4226437462951986,0.14285714285714285,7.4999999999999997E-2,28,0.41,0.18,7.8568310781318207E-2,0.48,0.39834024896265557,0.04,2.1000000000000001E-2,null,"ja","1b"]
[3,1,7,5,"Acker",null,"Zwischenfrucht mit 0 - 25 % Leg.",2.875,0.87500000000000011,0.38192928852029689,3.125,2.5933609958506221,0.3125,0.17499999999999999,16,0.46,0.14000000000000001,6.1108686163247501E-2,0.5,0.41493775933609955,0.05,2.7999999999999997E-2,null,"ja","1b"]
[3,1,7,5,"Acker",null,"Zwischenfrucht mit 25 - 75 % Leg.",2.875,0.87500000000000011,0.38192928852029689,3.125,2.5933609958506221,0.3125,0.17499999999999999,16,0.46,0.14000000000000001,6.1108686163247501E-2,0.5,0.41493775933609955,0.05,2.7999999999999997E-2,null,"ja","1b"]
[3,1,7,5,"Acker",null,"Zwischenfrucht mit > 75 % Leg.",2.875,0.87500000000000011,0.38192928852029689,3.125,2.5933609958506221,0.3125,0.17499999999999999,16,0.46,0.14000000000000001,6.1108686163247501E-2,0.5,0.41493775933609955,0.05,2.7999999999999997E-2,null,"ja","1b"]
[null,null,null,null,null,"Gemüse"," +++Gemüse+++",null,null,null,null,null,null,null,null,null,null,null,null,null,null,null,null,null,"1c"]
[1,0,12,10,"Acker",null,"Artischocke",null,null,null,null,null,null,null,null,0.19,0.05,2.1824530772588391E-2,0.24,0.19917012448132779,0.02,1.52E-2,null,{"$f":"+IF(B150=1,\"ja\",\"\")","v":""},"1c"]
[1,0,12,10,"Acker",null,"Auberginen",null,null,null,null,null,null,null,null,0.28000000000000003,0.05,2.1824530772588391E-2,0.3,0.24896265560165973,0.06,2.2400000000000003E-2,null,"","1c"]
[3,0,12,10,"Acker",null,"Blattsalate",null,null,null,null,null,null,null,null,0.19,6.9000000000000006E-2,3.04E-2,0.45,0.37344398340248963,0.02,1.52E-2,null,"","1c"]
[3,0,12,10,"Acker",null,"Blumenkohl",null,null,null,null,null,null,null,null,0.28000000000000003,0.10299999999999999,4.53E-2,0.36,0.29875518672199169,0.02,7.0000000000000007E-2,null,"","1c"]
[3,0,12,10,"Acker",null,"Brokkoli",null,null,null,null,null,null,null,null,0.45,0.14899999999999999,6.5600000000000006E-2,0.46,0.38174273858921159,0.03,0.09,null,"","1c"]
[1,0,12,10,"Acker",null,"Buschbohnen",null,null,null,null,null,null,null,null,0.25,9.1999999999999998E-2,4.0500000000000001E-2,0.3,0.24896265560165973,0.04,0.02,null,"","1c"]
[1,0,12,10,"Acker",null,"Chicoréerüben",null,null,null,null,null,null,null,null,0.25,0.121,5.3199999999999997E-2,0.54,0.44813278008298757,7.0000000000000007E-2,0.02,null,"","1c"]
[3,0,12,10,"Acker",null,"Chinakohl",null,null,null,null,null,null,null,null,0.15,9.1999999999999998E-2,4.0500000000000001E-2,0.3,0.24896265560165973,0.02,1.2E-2,null,"","1c"]
[3,0,12,10,"Acker",null,"Eissalat",null,null,null,null,null,null,null,null,0.14000000000000001,5.7000000000000002E-2,2.5100000000000001E-2,0.3,0.24896265560165973,0.02,1.1200000000000002E-2,null,"","1c"]
[3,0,12,10,"Acker",null,"Endivie, Frisèe",null,null,null,null,null,null,null,null,0.25,0.06,2.64E-2,0.55000000000000004,0.45643153526970953,0.03,0.02,null,"","1c"]
[3,0,12,10,"Acker",null,"Endivie, glattblättrig",null,null,null,null,null,null,null,null,0.2,0.06,2.64E-2,0.55000000000000004,0.45643153526970953,0.03,1.6E-2,null,null,"1c"]
[3,0,12,10,"Acker",null,"Feldsalat",null,null,null,null,null,null,null,null,0.45,9.9000000000000005E-2,4.36E-2,0.65,0.53941908713692943,7.0000000000000007E-2,0.06,null,"","1c"]
[1,0,12,10,"Acker",null,"Gemüseerbsen",null,null,null,null,null,null,null,null,1,0.22900000000000001,0.1008,0.36,0.29875518672199169,0.06,0.04,null,"","1c"]
[3,0,12,10,"Acker",null,"Grünkohl",null,null,null,null,null,null,null,null,0.49,0.16300000000000001,7.17E-2,0.59,0.48962655601659744,0.04,3.9199999999999999E-2,null,"","1c"]
[1,0,12,10,"Acker",null,"Gurke, Einlege-",null,null,null,null,null,null,null,null,0.15,6.9000000000000006E-2,3.04E-2,0.24,0.19917012448132779,0.02,1.2E-2,null,"","1c"]
[1,0,12,10,"Acker",null,"Kichererbsen",null,null,null,null,null,null,null,null,1,0.23,0.1003928415539066,0.36,0.29875518672199169,0.06,0.04,null,"","1c"]
[3,0,12,10,"Acker",null,"Knollenfenchel",null,null,null,null,null,null,null,null,0.2,6.9000000000000006E-2,3.04E-2,0.48,0.39834024896265557,0.03,1.6E-2,null,"","1c"]
[3,0,12,10,"Acker",null,"Kohlrabi",null,null,null,null,null,null,null,null,0.28000000000000003,0.10299999999999999,4.53E-2,0.42,0.34854771784232363,0.03,0.05,null,"","1c"]
[3,0,12,10,"Acker",null,"Kopfsalat",null,null,null,null,null,null,null,null,0.18,6.9000000000000006E-2,3.04E-2,0.36,0.29875518672199169,0.03,0.04,null,"","1c"]
[1,0,12,10,"Acker",null,"Kürbis, Öl-",null,null,null,null,null,null,null,null,3,2.9,1.2658227848101267,3,2.4896265560165975,1.4,0.02,null,"","1c"]
[1,0,12,10,"Acker",null,"Kürbis, Speise-",null,null,null,null,null,null,null,null,0.25,0.20599999999999999,9.06E-2,0.55000000000000004,0.45643153526970953,0.08,0.02,null,"","1c"]
[1,0,12,10,"Acker",null,"Mairüben (mit Laub)",null,null,null,null,null,null,null,null,0.17,0.1,0.05,0.42,0.35,0.04,0.01,null,null,"1c"]
[1,0,12,10,"Acker",null,"Markerbse",null,null,null,null,null,null,null,null,1,0.23,0.1,0.36,0.3,0.06,0.04,null,null,"1c"]
[1,0,12,10,"Acker",null,"Melone, Wasser-",null,null,null,null,null,null,null,null,9.6000000000000002E-2,0.02,8.7298123090353563E-3,0.13,0.10788381742738588,1.4999999999999999E-2,0.01,null,"","1c"]
[1,0,12,10,"Acker",null,"Melone, Zucker-, Honig-",null,null,null,null,null,null,null,null,0.15,5.3999999999999999E-2,2.3570493234395459E-2,0.37,0.30705394190871366,0.02,1.2E-2,null,"","1c"]
[3,0,12,10,"Acker",null,"Möhren, Bund-",null,null,null,null,null,null,null,null,0.17,8.2000000000000003E-2,3.61E-2,0.53,0.43983402489626555,0.05,0.03,null,"","1c"]
[1,0,12,10,"Acker",null,"Möhren, Industrie-",null,null,null,null,null,null,null,null,0.13,0.08,3.6200000000000003E-2,0.42,0.34854771784232363,0.03,0.02,null,"","1c"]
[1,0,12,10,"Acker",null,"Möhren, Wasch-",null,null,null,null,null,null,null,null,0.13,0.08,3.5200000000000002E-2,0.42,0.34854771784232363,0.03,0.02,null,"","1c"]
[1,0,12,10,"Acker",null,"Paprika",null,null,null,null,null,null,null,null,0.3,0.06,2.6189436927106065E-2,0.26,0.21576763485477177,0.05,2.4E-2,null,"","1c"]
[1,0,12,10,"Acker",null,"Pastinake",null,null,null,null,null,null,null,null,0.25,0.23599999999999999,0.1038,0.72,0.59751037344398339,0.09,0.02,null,"","1c"]
[1,0,12,10,"Acker",null,"Petersilie, Wurzel-",null,null,null,null,null,null,null,null,0.42,0.13700000000000001,6.0299999999999999E-2,0.84,0.69709543568464727,0.04,3.3599999999999998E-2,null,null,"1c"]
[3,0,12,10,"Acker",null,"Porree",null,null,null,null,null,null,null,null,0.25,0.08,3.5200000000000002E-2,0.36,0.29875518672199169,0.03,0.04,null,"","1c"]
[3,0,12,10,"Acker",null,"Radicchio",null,null,null,null,null,null,null,null,0.25,9.1999999999999998E-2,4.0500000000000001E-2,0.48,0.39834024896265557,0.03,0.02,null,null,"1c"]
[1,0,12,10,"Acker",null,"Radies",null,null,null,null,null,null,null,null,0.2,6.9000000000000006E-2,3.04E-2,0.34,0.28215767634854771,0.03,1.6E-2,null,"","1c"]
[3,0,12,10,"Acker",null,"Rettich, Bund-",null,null,null,null,null,null,null,null,0.17,7.5999999999999998E-2,3.3399999999999999E-2,0.36,0.29875518672199169,0.03,1.3600000000000001E-2,null,"","1c"]
[1,0,12,10,"Acker",null,"Rettich, deutsch",null,null,null,null,null,null,null,null,0.14000000000000001,0.08,3.5200000000000002E-2,0.4,0.33195020746887965,0.02,1.1200000000000002E-2,null,"","1c"]
[1,0,12,10,"Acker",null,"Rettich, japanisch",null,null,null,null,null,null,null,null,0.1,0.06,2.64E-2,0.34,0.28215767634854771,0.02,8.0000000000000002E-3,null,"","1c"]
[3,0,12,10,"Acker",null,"Rhabarber",null,null,null,null,null,null,null,null,0.18,4.8000000000000001E-2,2.1100000000000001E-2,0.5,0.41493775933609955,0.05,1.44E-2,null,"","1c"]
[3,0,12,10,"Acker",null,"Romana",null,null,null,null,null,null,null,null,0.2,9.1999999999999998E-2,4.0500000000000001E-2,0.4,0.33195020746887965,0.02,1.6E-2,null,"","1c"]
[1,0,12,10,"Acker",null,"Romana, Herzen",null,null,null,null,null,null,null,null,0.24,0.09,0.04,0.4,0.33,0.02,0.02,null,null,"1c"]
[1,0,12,10,"Acker",null,"Rosenkohl, nur Röschen",null,null,null,null,null,null,null,null,0.65,0.19500000000000001,8.5800000000000001E-2,0.66,0.54771784232365139,0.04,0.14000000000000001,null,"","1c"]
[1,0,12,10,"Acker",null,"Rote Rüben",null,null,null,null,null,null,null,null,0.28000000000000003,0.115,5.0599999999999999E-2,0.48,0.39834024896265557,0.05,0.02,null,"","1c"]
[3,0,12,10,"Acker",null,"Rotkohl",null,null,null,null,null,null,null,null,0.22,0.08,3.5200000000000002E-2,0.36,0.29875518672199169,0.03,0.08,null,"","1c"]
[3,0,12,10,"Acker",null,"Rucola",null,null,null,null,null,null,null,null,0.4,0.10299999999999999,4.53E-2,0.53,0.43983402489626555,0.05,3.2000000000000001E-2,null,{"$f":"+IF(B193=1,\"ja\",\"\")","v":""},"1c"]
[3,0,12,10,"Acker",null,"Salate, Baby Leaf Lettuce",null,null,null,null,null,null,null,null,0.35,0.08,0.04,0.6,0.5,0.04,0.03,null,null,"1c"]
[1,0,12,10,"Acker",null,"Schwarzwurzel",null,null,null,null,null,null,null,null,0.23,0.16,7.0400000000000004E-2,0.39,0.32365145228215769,0.04,1.84E-2,null,"","1c"]
[3,0,12,10,"Acker",null,"Sellerie, Bund-",null,null,null,null,null,null,null,null,0.27,0.126,5.5399999999999998E-2,0.56999999999999995,0.47302904564315301,0.03,2.1600000000000001E-2,null,"","1c"]
[1,0,12,10,"Acker",null,"Sellerie, Knollen-",null,null,null,null,null,null,null,null,0.25,0.14899999999999999,6.5600000000000006E-2,0.54,0.44813278008298757,0.03,0.02,null,"","1c"]
[3,0,12,10,"Acker",null,"Sellerie, Stangen-",null,null,null,null,null,null,null,null,0.25,0.115,5.0599999999999999E-2,0.54,0.44813278008298757,0.03,0.02,null,"","1c"]
[3,0,12,10,"Acker",null,"Spargel",null,null,null,null,null,null,null,null,0.26,8.2000000000000003E-2,3.61E-2,0.24,0.19917012448132779,0.02,2.0800000000000003E-2,null,"","1c"]
[3,0,12,10,"Acker",null,"Spinat, Blatt-, Frischmarkt, Baby",null,null,null,null,null,null,null,null,0.45,0.12,0.51,0.66,0.55000000000000004,0.08,0.03,null,null,"1c"]
[3,0,12,10,"Acker",null,"Spinat, Blatt-, Standard",null,null,null,null,null,null,null,null,0.4,0.12,0.51,0.66,0.55000000000000004,0.08,0.03,null,"","1c"]
[3,0,12,10,"Acker",null,"Spinat, Hack-, Standard",null,null,null,null,null,null,null,null,0.36,0.12,0.51,0.66,0.55000000000000004,0.08,0.03,null,null,"1c"]
[3,0,12,10,"Acker",null,"Stangenbohne",null,null,null,null,null,null,null,null,0.25,0.09,0.04,0.3,0.25,0.04,0.02,null,null,"1c"]
[1,0,12,10,"Acker",null,"Süßkartoffel",null,null,null,null,null,null,null,null,0.26,0.09,0.04,0.42,0.35,0.03,0.02,null,null,"1c"]
[1,0,12,10,"Acker",null,"Teltower Rübchen (Herbstanbau)",null,null,null,null,null,null,null,null,0.45,0.24,0.11,0.66,0.55000000000000004,0.08,0.04,null,null,"1c"]
[1,0,12,10,"Acker",null,"Tomate",null,null,null,null,null,null,null,null,0.3,0.05,2.1824530772588391E-2,0.39,0.32365145228215769,0.03,2.4E-2,null,"","1c"]
[3,0,12,10,"Acker",null,"Weißkohl",null,null,null,null,null,null,null,null,0.2,7.2999999999999995E-2,3.2000000000000001E-2,0.31,0.25726141078838172,0.03,0.08,null,"","1c"]
[3,0,12,10,"Acker",null,"Wirsing",null,null,null,null,null,null,null,null,0.35,0.115,5.0599999999999999E-2,0.39,0.32365145228215769,0.02,2.7999999999999997E-2,null,"","1c"]
[1,0,12,10,"Acker",null,"Zucchini",null,null,null,null,null,null,null,null,0.16,0.06,2.64E-2,0.2,0.16597510373443983,0.03,1.2800000000000001E-2,null,"","1c"]
[3,0,12,10,"Acker",null,"Zuckerhut",null,null,null,null,null,null,null,null,0.2,0.115,5.0599999999999999E-2,0.3,0.24896265560165973,0.02,1.6E-2,null,"","1c"]
[1,0,12,10,"Acker",null,"Zuckermais",null,null,null,null,null,null,null,null,0.35,0.16,7.0400000000000004E-2,0.26,0.21576763485477177,0.06,2.7999999999999997E-2,null,"","1c"]
[3,0,12,10,"Acker",null,"Zwiebel, Bund-",null,null,null,null,null,null,null,null,0.2,0.06,2.64E-2,0.24,0.19917012448132779,0.03,1.6E-2,null,"","1c"]
[1,0,12,10,"Acker",null,"Zwiebel, Trocken-",null,null,null,null,null,null,null,null,0.18,0.08,3.5200000000000002E-2,0.24,0.19933554817275748,0.03,0.04,null,"","1c"]
[null,null,null,null,null,"Heil- und Gewürzpflanzen"," +++Heil- und Gewürzpflanzen+++",null,null,null,null,null,null,null,null,null,null,null,null,null,null,null,null,"","1d"]
[3,0,14,11,"Acker",null,"Akelei (Blühendes Kraut)",null,null,null,null,null,null,null,null,0.45999999999999996,0.137484,6.0010475774770845E-2,0.81940000000000002,0.67999999999999994,2.7854400000000001E-2,3.7999999999999999E-2,null,null,"1d"]
[1,0,14,11,"Acker",null,"Alant (Wurzeln)",null,null,null,null,null,null,null,null,0.5,0.21,9.1663029244871241E-2,0.76,0.63070539419087135,7.0000000000000007E-2,0.04,null,null,"1d"]
[3,0,14,11,"Acker",null,"Ampfer, Krauser (Kraut nach der Blüte)",null,null,null,null,null,null,null,null,0.5,0.16,6.9838498472282851E-2,0.8,0.66390041493775931,0.1,0.04,null,null,"1d"]
[1,0,14,11,"Acker",null,"Ampfer, Wiesen- (Blatt)",null,null,null,null,null,null,null,null,0.33,0.11,4.801396769969446E-2,0.53,0.43983402489626555,0.02,0.04,null,null,"1d"]
[1,0,14,11,"Acker",null,"Anis (Samen (Droge!))",null,null,null,null,null,null,null,null,2.65,1.1499999999999999,0.50196420776953288,1.55,1.2863070539419086,0.38,0.21,null,null,"1d"]
[1,0,14,11,"Acker",null,"Arzneifenchel (Früchte (Droge!))",null,null,null,null,null,null,null,null,2.78,1.26,0.54997817546922745,2.58,2.1410788381742738,0.43,0.22,null,null,"1d"]
[1,0,14,11,"Acker",null,"Arzneirhabarber (Wurzeln)",null,null,null,null,null,null,null,null,0.4,0.25,0.10912265386294195,0.47,0.39004149377593356,0.12,0.05,null,null,"1d"]
[3,0,14,11,"Acker",null,"Bärlauch (Blätter)",null,null,null,null,null,null,null,null,0.5,0.75,0.32736796158882586,0.4,0.33195020746887965,0.2,1.1000000000000001,null,null,"1d"]
[1,0,14,11,"Acker",null,"Baikal-Helmkraut (Wurzeln)",null,null,null,null,null,null,null,null,0.75,0.25,0.10912265386294195,0.62,0.51452282157676343,0.23,0.06,null,null,"1d"]
[1,0,14,11,"Acker",null,"Baldrian (Wurzeln)",null,null,null,null,null,null,null,null,0.28999999999999998,0.19,8.2933216935835885E-2,0.41,0.34024896265560162,0.06,0.02,null,null,"1d"]
[3,0,14,11,"Acker",null,"Basilikum (Kraut b. Blühbeginn)",null,null,null,null,null,null,null,null,0.33,0.09,3.9284155390659103E-2,0.39,0.32365145228215769,7.0000000000000007E-2,0.03,null,null,"1d"]
[1,0,14,11,"Acker",null,"Bergarnika (Blütenkörbe)",null,null,null,null,null,null,null,null,0.4,0.16,6.9838498472282851E-2,0.48,0.39834024896265557,0.06,0.03,null,null,"1d"]
[3,0,14,11,"Acker",null,"Bergbohnenkraut (Blühendes Kraut)",null,null,null,null,null,null,null,null,0.65,0.16,6.9838498472282851E-2,0.74,0.61410788381742731,0.15,0.05,null,null,"1d"]
[3,0,14,11,"Acker",null,"Besenbeifuß (A. scoparia) (Kraut)",null,null,null,null,null,null,null,null,0.59,0.15,6.5473592317765172E-2,0.76,0.63070539419087135,0.04,0.05,null,null,"1d"]
[1,0,14,11,"Acker",null,"Bibernelle, Kleine (Wurzeln)",null,null,null,null,null,null,null,null,0.35,0.17,7.4203404626800529E-2,0.51,0.42323651452282157,0.06,0.03,null,null,"1d"]
[3,0,14,11,"Acker",null,"Blaue Malve (blühendes Kraut)",null,null,null,null,null,null,null,null,0.35,0.16,6.9838498472282851E-2,0.69,0.57261410788381739,7.0000000000000007E-2,0.03,null,null,"1d"]
[1,0,14,11,"Acker",null,"Blaue Malve (Blüten)",null,null,null,null,null,null,null,null,0.3,0.16,6.9838498472282851E-2,0.47,0.39004149377593356,7.0000000000000007E-2,0.02,null,null,"1d"]
[1,0,14,11,"Acker",null,"Bockshornklee (Samen (Droge!))",null,null,null,null,null,null,null,null,3.87,1.4,0.61108686163247483,1.53,1.2697095435684647,1.4,0.31,null,null,"1d"]
[3,0,14,11,"Acker",null,"Bohnenkraut, einjährig (Blühendes Kraut)",null,null,null,null,null,null,null,null,0.32,0.12,5.2378873854212131E-2,0.49,0.40663900414937754,7.0000000000000007E-2,0.03,null,null,"1d"]
[3,0,14,11,"Acker",null,"Borretsch (Blühendes Kraut)",null,null,null,null,null,null,null,null,0.15,0.05,2.1824530772588391E-2,0.44,0.36514522821576761,0.02,0.01,null,null,"1d"]
[3,0,14,11,"Acker",null,"Braunelle (Kraut zu Ende der Blüte)",null,null,null,null,null,null,null,null,0.34,0.17,7.4203404626800529E-2,0.8,0.66390041493775931,0.12,0.05,null,null,"1d"]
[3,0,14,11,"Acker",null,"Brennnessel, Große (Nicht blühendes Kraut)",null,null,null,null,null,null,null,null,0.59,0.16,6.9838498472282851E-2,0.69,0.57261410788381739,0.1,0.05,null,null,"1d"]
[3,0,14,11,"Acker",null,"Brennnessel, Kleine (Blühendes Kraut)",null,null,null,null,null,null,null,null,0.7,0.15,6.5473592317765172E-2,0.79,0.65560165975103735,0.09,0.06,null,null,"1d"]
[3,0,14,11,"Acker",null,"Brunnenkresse (Kraut)",null,null,null,null,null,null,null,null,0.3,9.1999999999999998E-2,4.0157136621562638E-2,0.71,0.58921161825726132,0.04,2.4E-2,null,null,"1d"]
[3,0,14,11,"Acker",null,"Dill, Frischmarkt (Kraut)",null,null,null,null,null,null,null,null,0.3,9.1999999999999998E-2,4.0500000000000001E-2,0.71,0.58921161825726132,0.04,2.4E-2,null,null,"1d"]
[3,0,14,11,"Acker",null,"Dill, Industrieware (Kraut b. Knospenansatz)",null,null,null,null,null,null,null,null,0.3,9.1999999999999998E-2,4.0500000000000001E-2,0.71,0.58921161825726132,0.04,0.02,null,null,"1d"]
[3,0,14,11,"Acker",null,"Dost, Oregano (Blühendes Kraut)",null,null,null,null,null,null,null,null,0.5,0.14000000000000001,6.1108686163247501E-2,0.52,0.43153526970954353,0.17,0.04,null,null,"1d"]
[3,0,14,11,"Acker",null,"Drachenkopf (Blühendes Kraut)",null,null,null,null,null,null,null,null,0.27,0.11,4.801396769969446E-2,0.65,0.53941908713692943,0.03,0.02,null,null,"1d"]
[1,0,14,11,"Acker",null,"Eibisch (Wurzeln)",null,null,null,null,null,null,null,null,0.66,0.3,0.13094718463553034,0.72,0.59751037344398339,0.2,0.05,null,null,"1d"]
[3,0,14,11,"Acker",null,"Eisenkraut, Echtes (Kraut)",null,null,null,null,null,null,null,null,0.48,0.14000000000000001,6.1108686163247501E-2,0.6,0.49792531120331945,0.08,0.04,null,null,"1d"]
[1,0,14,11,"Acker",null,"Engelwurz, Chinesische (Wurzeln)",null,null,null,null,null,null,null,null,0.42,0.25,0.10912265386294195,0.54,0.44813278008298757,7.0000000000000007E-2,0.04,null,null,"1d"]
[1,0,14,11,"Acker",null,"Engelwurz, Europäische (Wurzeln)",null,null,null,null,null,null,null,null,0.3,0.23,0.1003928415539066,0.65,0.53941908713692943,0.09,0.02,null,null,"1d"]
[3,0,14,11,"Acker",null,"Enzian (Wurzeln nach 4 Jahren)",null,null,null,null,null,null,null,null,0.3,0.2,8.7298123090353563E-2,0.6,0.49792531120331945,0.1,null,null,null,"1d"]
[3,0,14,11,"Acker",null,"Estragon, Deutscher (Nicht blühendes Kraut)",null,null,null,null,null,null,null,null,0.55000000000000004,0.16,6.9838498472282851E-2,0.88,0.73029045643153523,0.04,0.04,null,null,"1d"]
[1,0,14,11,"Acker",null,"Färberdistel (Samen)",null,null,null,null,null,null,null,null,2.06,1.1200000000000001,0.48886948930598001,0.66,0.54771784232365139,0.3,0.16,null,null,"1d"]
[3,0,14,12,"Acker",null,"Federmohn, 1. Standjahr (Kraut)",null,null,null,null,null,null,null,null,0.52,0.08,3.4919249236141425E-2,0.41,0.34024896265560162,7.0000000000000007E-2,0.06,null,null,"1d"]
[3,0,14,13,"Acker",null,"Federmohn, ab 2. Standjahr (Kraut)",null,null,null,null,null,null,null,null,0.36,0.05,2.1824530772588391E-2,0.26,0.21576763485477177,7.0000000000000007E-2,0.05,null,null,"1d"]
[3,0,14,11,"Acker",null,"Frauenmantel (Blühendes Kraut)",null,null,null,null,null,null,null,null,0.38,0.13739999999999999,5.9973810563072896E-2,0.5302,0.44,9.9479999999999985E-2,null,null,null,"1d"]
[3,0,14,11,"Acker",null,"Galega (Geißraute) (Kraut)",null,null,null,null,null,null,null,null,0.37,0.08,3.4919249236141425E-2,0.66,0.54771784232365139,7.0000000000000007E-2,0.03,null,null,"1d"]
[3,0,14,11,"Acker",null,"Gartenkresse (Kraut)",null,null,null,null,null,null,null,null,0.67200000000000004,8.6999999999999994E-2,3.7974683544303799E-2,0.66,0.54771784232365139,0,null,null,null,"1d"]
[3,0,14,11,"Acker",null,"Goldrute (Blühhorizont)",null,null,null,null,null,null,null,null,0.6,0.21,9.1663029244871241E-2,0.77,0.63900414937759331,0.05,0.05,null,null,"1d"]
[3,0,14,11,"Acker",null,"Johanniskraut (Blühendes Kraut)",null,null,null,null,null,null,null,null,0.53,0.2,8.7298123090353563E-2,0.6,0.49792531120331945,7.0000000000000007E-2,0.04,null,null,"1d"]
[1,0,14,11,"Acker",null,"Kamille (Blüten, Blühhorizont)",null,null,null,null,null,null,null,null,0.42,0.21,9.1663029244871241E-2,0.54,0.44813278008298757,0.01,0.03,null,null,"1d"]
[3,0,14,11,"Acker",null,"Kapuzinerkresse (Blühendes Kraut)",null,null,null,null,null,null,null,null,0.35,0.09,3.9284155390659103E-2,0.37,0.30705394190871366,0.04,0.09,null,null,"1d"]
[3,0,14,11,"Acker",null,"Kerbel (Kraut)",null,null,null,null,null,null,null,null,0.41,0.1,4.3649061545176782E-2,0.7,0.58091286307053935,0.04,0.03,null,null,"1d"]
[3,0,14,11,"Acker",null,"Koriander, Kraut (Kraut für Blattdroge)",null,null,null,null,null,null,null,null,0.41,0.1,4.3649061545176782E-2,0.7,0.58091286307053935,0.04,0.03,null,null,"1d"]
[1,0,14,11,"Acker",null,"Koriander (Samen (Droge!))",null,null,null,null,null,null,null,null,2.6,1.1000000000000001,0.4801396769969446,1.55,1.2863070539419086,0.38,0.21,null,null,"1d"]
[3,0,14,11,"Acker",null,"Kornblume, blüh. Kraut (Blühendes Kraut)",null,null,null,null,null,null,null,null,0.37,0.1,4.3649061545176782E-2,0.63,0.5228215767634854,0.05,0.3,null,null,"1d"]
[1,0,14,11,"Acker",null,"Kornblume, Blüten (Blüten)",null,null,null,null,null,null,null,null,0.44,0.19,8.2933216935835885E-2,0.5,0.41493775933609955,0.06,0.04,null,null,"1d"]
[1,0,14,11,"Acker",null,"Kümmel (Früchte (Droge!))",null,null,null,null,null,null,null,null,2.65,1.1499999999999999,0.50196420776953288,1.55,1.2863070539419086,0.38,0.21,null,null,"1d"]
[1,0,14,11,"Acker",null,"Lavendel (Blütenähren)",null,null,null,null,null,null,null,null,0.51,0.13,5.6743780008729816E-2,0.77,0.63900414937759331,0.15,0.06,null,null,"1d"]
[3,0,14,11,"Acker",null,"Liebstöckel (Nicht blühendes Kraut)",null,null,null,null,null,null,null,null,0.37,0.11,4.801396769969446E-2,0.5,0.41493775933609955,0.06,0.03,null,null,"1d"]
[3,0,14,11,"Acker",null,"Löwenzahn (Kraut)",null,null,null,null,null,null,null,null,0.33,0.11,4.801396769969446E-2,0.53,0.43983402489626555,0.02,0.04,null,null,"1d"]
[1,0,14,12,"Acker",null,"Löwenzahn, Kaukasischer (Wurzeln)",null,null,null,null,null,null,null,null,0.5,0.21,9.1663029244871241E-2,0.76,0.63070539419087135,7.0000000000000007E-2,0.04,null,null,"1d"]
[3,0,14,11,"Acker",null,"Mädesüß (Blühendes Kraut)",null,null,null,null,null,null,null,null,0.49,0.2,8.7298123090353563E-2,0.79,0.65560165975103735,0.21,0.05,null,null,"1d"]
[3,0,14,11,"Acker",null,"Majoran (Kraut bei Blühbeginn)",null,null,null,null,null,null,null,null,0.48,0.14000000000000001,6.1108686163247501E-2,0.59,0.48962655601659744,7.0000000000000007E-2,0.04,null,null,"1d"]
[1,0,14,11,"Acker",null,"Mariendistel (Samen (Droge!))",null,null,null,null,null,null,null,null,2.06,1.1200000000000001,0.48886948930598001,0.66,0.54771784232365139,0.3,0.16,null,null,"1d"]
[1,0,14,11,"Acker",null,"Meerrettich (Wurzeln)",null,null,null,null,null,null,null,null,0.7,0.22,9.602793539938892E-2,0.72,0.59751037344398339,7.0000000000000007E-2,5.5999999999999994E-2,null,null,"1d"]
[3,0,14,11,"Acker",null,"Melde (Kraut)",null,null,null,null,null,null,null,null,0.33,0.11,4.801396769969446E-2,0.53,0.43983402489626555,0.02,0.04,null,null,"1d"]
[1,0,14,11,"Acker",null,"Mohn (Samen und Kapseln)",null,null,null,null,null,null,null,null,1.5913978494623655,0.94623655913978499,0.41302337806188782,1.6344086021505377,1.3563556864319815,0.5161290322580645,null,null,null,"1d"]
[3,0,14,11,"Acker",null,"Muskatteller Salbei (Blühendes Kraut)",null,null,null,null,null,null,null,null,0.24,7.0000000000000007E-2,3.0554343081623751E-2,0.35,0.29045643153526968,0.1,0.02,null,null,"1d"]
[3,0,14,11,"Acker",null,"Mutterkraut (T. parthenium) (Blühendes Kraut)",null,null,null,null,null,null,null,null,0.45,0.16,6.9838498472282851E-2,0.8,0.66390041493775931,0.05,0.04,null,null,"1d"]
[3,0,14,11,"Acker",null,"Mutterkraut, Chin. (L. jap.) (Blühendes Kraut)",null,null,null,null,null,null,null,null,0.51,0.14000000000000001,6.1108686163247501E-2,0.84,0.69709543568464727,0.11,0.04,null,null,"1d"]
[1,0,14,11,"Acker",null,"Nachtkerze (Samen (Droge!))",null,null,null,null,null,null,null,null,2.06,1.1200000000000001,0.48886948930598001,0.66,0.54771784232365139,0.3,0.16,null,null,"1d"]
[3,0,14,11,"Acker",null,"Petersilie, Blatt- (Blätter bis 1. Schnitt)",null,null,null,null,null,null,null,null,0.45,0.115,5.0599999999999999E-2,0.53,0.43983402489626555,0.06,0.04,null,null,"1d"]
[1,0,14,11,"Acker",null,"Petersilie, Blatt- (Blatt nach 1 Schnitt)",null,null,null,null,null,null,null,null,0.45,0.115,5.0599999999999999E-2,0.53,0.43983402489626555,0.06,0.04,null,null,"1d"]
[3,0,14,11,"Acker",null,"Pfefferminze, Minzen (Nicht blühendes Kraut)",null,null,null,null,null,null,null,null,0.42,0.11,4.801396769969446E-2,0.55000000000000004,0.45643153526970953,0.08,0.03,null,null,"1d"]
[3,0,14,11,"Acker",null,"Ringelblume, blüh. Kraut (Blühendes Kraut)",null,null,null,null,null,null,null,null,0.28999999999999998,7.0000000000000007E-2,3.0554343081623751E-2,0.5,0.41493775933609955,0.05,0.02,null,null,"1d"]
[1,0,14,11,"Acker",null,"Ringelblume, Blüte (Blütenkörbe)",null,null,null,null,null,null,null,null,0.3,0.12,5.2378873854212131E-2,0.46,0.38174273858921159,0.05,0.02,null,null,"1d"]
[3,0,14,11,"Acker",null,"Rosmarin (Nicht blühendes Kraut)",null,null,null,null,null,null,null,null,0.58333333333333337,0.09,3.9284155390659103E-2,0.5,0.41493775933609955,0.3,null,null,null,"1d"]
[1,0,14,11,"Acker",null,"Rotwurzelsalbei (S. miltior.) (Wurzeln)",null,null,null,null,null,null,null,null,0.36,0.13,5.6743780008729816E-2,0.41,0.34024896265560162,0.18,0.03,null,null,"1d"]
[3,0,14,11,"Acker",null,"Salbei (Salvia officinalis) (Nicht blühendes Kraut)",null,null,null,null,null,null,null,null,0.49,0.11,4.801396769969446E-2,0.62,0.51452282157676343,0.13,0.04,null,null,"1d"]
[1,0,14,11,"Acker",null,"Saposhnikovia (Wurzel)",null,null,null,null,null,null,null,null,0.5,0.23,0.1003928415539066,0.64,0.53112033195020747,7.0000000000000007E-2,0.05,null,null,"1d"]
[1,0,14,11,"Acker",null,"Saussurea costus (Wurzel)",null,null,null,null,null,null,null,null,0.5,0.21,9.1663029244871241E-2,0.76,0.63070539419087135,7.0000000000000007E-2,0.04,null,null,"1d"]
[3,0,14,11,"Acker",null,"Schabzigerklee (Blühendes Kraut)",null,null,null,null,null,null,null,null,0.37,0.08,3.4919249236141425E-2,0.66,0.54771784232365139,7.0000000000000007E-2,0.03,null,null,"1d"]
[3,0,14,11,"Acker",null,"Schafgarbe (Blühhorizont)",null,null,null,null,null,null,null,null,0.46,0.16,6.9838498472282851E-2,0.77,0.63900414937759331,0.05,0.04,null,null,"1d"]
[3,0,14,11,"Acker",null,"Schleifenblume, Bittere (Kraut)",null,null,null,null,null,null,null,null,0.35,0.09,3.9284155390659103E-2,0.37,0.30705394190871366,0.04,0.09,null,null,"1d"]
[1,0,14,11,"Acker",null,"Schlüsselblume (Wurzeln)",null,null,null,null,null,null,null,null,0.27,0.15,6.5473592317765172E-2,0.35,0.29045643153526968,0.09,0.02,null,null,"1d"]
[3,0,14,11,"Acker",null,"Schnittknoblauch (Kraut)",null,null,null,null,null,null,null,null,0.5,0.14000000000000001,6.1108686163247501E-2,0.52,0.43153526970954353,7.0000000000000007E-2,0.04,null,null,"1d"]
[3,0,14,11,"Acker",null,"Schnittlauch (Kraut, bis 1. Schnitt)",null,null,null,null,null,null,null,null,0.5,0.13700000000000001,6.0299999999999999E-2,0.52,0.43153526970954353,7.1999999999999995E-2,0.04,null,null,"1d"]
[3,0,14,11,"Acker",null,"Schnittlauch, nach 1. Schnitt (gesät, nach 1 Schnitt)",null,null,null,null,null,null,null,null,0.5,0.13700000000000001,6.0299999999999999E-2,0.52,0.43153526970954353,7.1999999999999995E-2,0.04,null,null,"1d"]
[3,0,14,11,"Acker",null,"Schnittlauch, für Treiberei (Anbau f. Treiberei)",null,null,null,null,null,null,null,null,0.5,0.13700000000000001,6.0299999999999999E-2,0.52,0.43153526970954353,7.1999999999999995E-2,0.04,null,null,"1d"]
[3,0,14,11,"Acker",null,"Schöllkraut (Blühendes Kraut)",null,null,null,null,null,null,null,null,0.4,0.11,4.801396769969446E-2,0.5,0.41493775933609955,0.08,0.05,null,null,"1d"]
[3,0,14,11,"Acker",null,"Sellerie, Schnitt- (Kraut)",null,null,null,null,null,null,null,null,0.37,0.11,4.801396769969446E-2,0.5,0.41493775933609955,0.06,0.03,null,null,"1d"]
[1,0,14,11,"Acker",null,"Senf, Brauner (Samen)",null,null,null,null,null,null,null,null,5,1.77,0.77258838934962903,0.93,0.77178423236514526,0.3,null,null,null,"1d"]
[1,0,14,11,"Acker",null,"Senf, Gelber/Weißer (Samen)",null,null,null,null,null,null,null,null,5,1.77,0.77258838934962903,0.93,0.77178423236514526,0.3,null,null,null,"1d"]
[3,0,14,11,"Acker",null,"Siegesbeckia (Blühendes Kraut)",null,null,null,null,null,null,null,null,0.26,0.1,4.3649061545176782E-2,0.54,0.44813278008298757,0.08,0.03,null,null,"1d"]
[1,0,14,11,"Acker",null,"Sonnenhut (E.angustifolia) (Blühendes Kraut)",null,null,null,null,null,null,null,null,0.56000000000000005,0.12,5.2378873854212131E-2,0.82,0.68049792531120323,0.14000000000000001,0.08,null,null,"1d"]
[2,0,14,11,"Acker",null,"Sonnenhut (E.angustifolia) (Wurzeln)",null,null,null,null,null,null,null,null,0.95,0.2,8.7298123090353563E-2,0.45,0.37344398340248963,0.1,0.04,null,null,"1d"]
[1,0,14,11,"Acker",null,"Sonnenhut (E.pallida) (Blühendes Kraut)",null,null,null,null,null,null,null,null,0.31,0.1,4.3649061545176782E-2,0.45,0.37344398340248963,0.11,null,null,null,"1d"]
[2,0,14,11,"Acker",null,"Sonnenhut (E.pallida) (Wurzeln)",null,null,null,null,null,null,null,null,0.57999999999999996,0.14000000000000001,6.1108686163247501E-2,0.49,0.40663900414937754,0.08,null,null,null,"1d"]
[1,0,14,11,"Acker",null,"Sonnenhut (E.purpurea) (Blühendes Kraut)",null,null,null,null,null,null,null,null,0.44,0.13,5.6743780008729816E-2,0.83,0.6887966804979252,0.14000000000000001,0.02,null,null,"1d"]
[2,0,14,11,"Acker",null,"Sonnenhut (E.purpurea) (Wurzeln)",null,null,null,null,null,null,null,null,0.46,0.14000000000000001,6.1108686163247501E-2,0.5,0.41493775933609955,0.14000000000000001,null,null,null,"1d"]
[3,0,14,11,"Acker",null,"Spitzwegerich (Kraut)",null,null,null,null,null,null,null,null,0.33,0.11,4.801396769969446E-2,0.53,0.43983402489626555,0.02,0.04,null,null,"1d"]
[3,0,14,11,"Acker",null,"Steinklee, Gelber (Blühendes Kraut)",null,null,null,null,null,null,null,null,0.57999999999999996,0.14000000000000001,6.1108686163247501E-2,0.41,0.34024896265560162,0.03,0.05,null,null,"1d"]
[1,0,14,11,"Acker",null,"Schwarzkümmel (Samen (Droge!))",null,null,null,null,null,null,null,null,3.6,1.71,0.74639895242252297,0.92,0.76348547717842319,0.48,null,null,null,"1d"]
[3,0,14,11,"Acker",null,"Thymian (Blühendes Kraut)",null,null,null,null,null,null,null,null,0.44,0.12,5.2378873854212131E-2,0.77,0.63900414937759331,0.08,0.04,null,null,"1d"]
[3,0,14,11,"Acker",null,"Tollkirsche (Kraut)",null,null,null,null,null,null,null,null,0.73,0.46,0.2007856831078132,0.55000000000000004,0.45643153526970953,0.13,0.04,null,null,"1d"]
[1,0,14,11,"Acker",null,"Tragant, Chinesischer (Wurzeln)",null,null,null,null,null,null,null,null,0.56999999999999995,0.25,0.10912265386294195,0.49,0.40663900414937754,0.08,0.1,null,null,"1d"]
[3,0,14,11,"Acker",null,"Wermut, Beifuß (Nicht blühendes Kraut)",null,null,null,null,null,null,null,null,0.39,0.17,7.4203404626800529E-2,0.67,0.55601659751037347,0.08,7.0000000000000007E-2,null,null,"1d"]
[3,0,14,11,"Acker",null,"Wiesenknopf, Kleiner (Kraut)",null,null,null,null,null,null,null,null,0.41,0.1,4.3649061545176782E-2,0.7,0.58091286307053935,0.04,0.03,null,null,"1d"]
[3,0,14,11,"Acker",null,"Winterheckenzwiebel (Kraut)",null,null,null,null,null,null,null,null,0.5,0.14000000000000001,6.1108686163247501E-2,0.52,0.43153526970954353,7.0000000000000007E-2,0.04,null,null,"1d"]
[3,0,14,11,"Acker",null,"Ysop (Blühendes Kraut)",null,null,null,null,null,null,null,null,0.42,0.1,4.3649061545176782E-2,0.56000000000000005,0.46473029045643155,0.12,0.11,null,null,"1d"]
[3,0,14,11,"Acker",null,"Zitronenmelisse (Nicht blühendes Kraut)",null,null,null,null,null,null,null,null,0.49,0.14000000000000001,6.1108686163247501E-2,0.76,0.63070539419087135,0.09,0.04,null,null,"1d"]
[3,0,14,11,"Acker",null,"Zitronenverbene (Kraut)",null,null,null,null,null,null,null,null,0.48,0.14000000000000001,6.1108686163247501E-2,0.6,0.49792531120331945,0.08,0.04,null,null,"1d"]
[null,null,13,6,null,"Grünland"," +++Grünland+++",null,null,null,null,null," ",null,null,null,null,null,null,null,null,null,null,{"$f":"+IF(B320=1,\"ja\",\"\")","v":""},2]
[3,1,13,16,"Grünland",null,"Streuwiese",1.28,0.46,0.2007856831078132,1.81,1.5020746887966805,0.33,0.13,100,{"$f":"+H321","v":1.28},{"$f":"+I321","v":0.46},0.2007856831078132,1.81,1.5020746887966805,0.33,0.13,8,"ja",2]
[3,1,13,6,"Grünland",null,"1 Schnittnutzung",1.3759999999999999,0.5,0.22,1.93,1.6016597510373443,0.35,0.1376,100,{"$f":"+H322","v":1.3759999999999999},0.5,0.22,1.93,1.6016597510373443,0.35,0.1376,8.6,"ja",2]
[3,1,13,6,"Grünland",null,"2 Schnittnutzungen",1.8240000000000001,0.65,0.28999999999999998,2.41,2,0.4,0.18240000000000001,100,1.8240000000000001,0.65,0.28999999999999998,2.41,2,0.4,0.18240000000000001,11.4,"ja",2]
[3,1,13,6,"Grünland",null,"3 Schnittnutzungen",2.4,0.71,0.31,2.89,2.3983402489626555,0.41,0.24,100,2.4,0.71,0.31,2.89,2.3983402489626555,0.41,0.24,15,"ja",2]
[3,1,13,6,"Grünland",null,"4 Schnittnutzungen",2.72,0.81,0.36,3.13,2.5975103734439831,0.45,0.27200000000000002,100,2.72,0.81,0.36,3.13,2.5975103734439831,0.45,0.27200000000000002,17,"ja",2]
[3,1,13,6,"Grünland",null,"5 Schnittnutzungen",2.8,0.87,0.38,3.25,2.697095435684647,0.45,0.27999999999999997,100,2.8,0.87,0.38,3.25,2.697095435684647,0.45,0.27999999999999997,17.5,"ja",2]
[3,1,13,6,"Grünland",null,"6 Schnittnutzungen",2.9119999999999999,0.89,0.38847664775207336,3.37,2.796680497925311,0.45,0.29120000000000001,100,2.9119999999999999,0.89,0.38847664775207336,3.37,2.796680497925311,0.45,0.29120000000000001,18.2,"ja",2]
[3,1,13,6,"Grünland",null,"Mähweide extensiv 20 % Weide",1.98,0.69,0.30117852466171974,2.65,2.1991701244813275,0.4,0.19800000000000001,100,1.98,0.69,0.30117852466171974,2.65,2.1991701244813275,0.4,0.19800000000000001,12.375,"ja",2]
[3,1,13,6,"Grünland",null,"Mähweide mittelintensiv 20 % Weide",2.75,0.76,0.33173286774334354,3.01,2.4979253112033191,0.41,0.27500000000000002,100,2.75,0.76,0.33173286774334354,3.01,2.4979253112033191,0.41,0.27500000000000002,17.1875,"ja",2]
[3,1,13,6,"Grünland",null,"Mähweide intensiv 20 % Weide",2.8,0.85,0.37101702313400264,3.25,2.697095435684647,0.45,0.27999999999999997,100,2.8,0.85,0.37101702313400264,3.25,2.697095435684647,0.45,0.27999999999999997,17.5,"ja",2]
[3,1,13,6,"Grünland",null,"Mähweide extensiv 60 % Weide",2,0.69,0.30117852466171974,2.65,2.1991701244813275,0.4,0.2,100,2,0.69,0.30117852466171974,2.65,2.1991701244813275,0.4,0.2,12.5,"ja",2]
[3,1,13,6,"Grünland",null,"Mähweide mittelintensiv 60 % Weide",2.61,0.76,0.33173286774334354,3.01,2.4979253112033191,0.41,0.26100000000000001,100,2.61,0.76,0.33173286774334354,3.01,2.4979253112033191,0.41,0.26100000000000001,16.3125,"ja",2]
[3,1,13,6,"Grünland",null,"Mähweide intensiv 60 % Weide",2.82,0.85,0.37101702313400264,3.25,2.697095435684647,0.45,0.28199999999999997,100,2.82,0.85,0.37101702313400264,3.25,2.697095435684647,0.45,0.28199999999999997,17.600000000000001,"ja",2]
[3,1,13,6,"Grünland",null,"Weide extensiv",2,0.71,0.30990833697075515,2.77,2.2987551867219915,0.4,0.2,100,2,0.71,0.30990833697075515,2.77,2.2987551867219915,0.4,0.2,12.5,"ja",2]
[3,1,13,6,"Grünland",null,"Weide mittel",2.448,0.8,0.34919249236141425,3.13,2.5975103734439831,0.41299999999999998,0.24479999999999999,100,2.448,0.8,0.34919249236141425,3.13,2.5975103734439831,0.41299999999999998,0.24479999999999999,15.3,"ja",2]
[3,1,13,6,"Grünland",null,"Weide intensiv",2.88,0.89,0.38847664775207336,3.37,2.796680497925311,0.45,0.28799999999999998,100,2.88,0.89,0.38847664775207336,3.37,2.796680497925311,0.45,0.28799999999999998,18,"ja",2]
[3,1,13,6,"Grünland",null,"Hutungen",1.6,0.56999999999999995,0.24879965080750763,2.17,1.800829875518672,0.36,0.16,100,1.6,0.56999999999999995,0.24879965080750763,2.17,1.800829875518672,0.36,0.16,10,"ja",2]
[3,1,13,6,"Grünland",null,"Almen",2.2400000000000002,0.73,0.31863814927979051,2.77,2.2987551867219915,0.4,0.22400000000000003,100,{"$f":"+H338","v":2.2400000000000002},0.73,0.31863814927979051,2.77,2.2987551867219915,0.4,0.22400000000000003,14,"ja",2]
[null,null,null,null,null,"Milch"," +++Milch+++",null,null,null,null,null,null,null,null,null,null,null,null,null,null,null,null,"",6]
[null,2,null,18,null,null,"Kuhmilch (3,2 % Eiweiß)",null,null,null,null,null,null,null,13.1,0.5,0.23,0.1,0.18,0.15,0.02,0.05,{"$f":"+P340/O340*100*6.38","v":24.351145038167939},"",6]
[null,2,null,18,null,null,"Kuhmilch (3,4 % Eiweiß)",null,null,null,null,null,null,null,13.3,0.53,0.23,0.1,0.18,0.15,0.02,0.05,{"$f":"+P341/O341*100*6.38","v":25.42406015037594},"",6]
[null,2,null,18,null,null,"Kuhmilch (3,6 % Eiweiß)",null,null,null,null,null,null,null,13.5,0.56000000000000005,0.23,0.1,0.18,0.15,0.02,0.06,{"$f":"+P342/O342*100*6.38","v":26.465185185185188},"",6]
[null,2,null,18,null,null,"Stutenmilch (2,2 % Eiweiß)",null,null,null,null,null,null,null,10.3,0.35,0.14000000000000001,0.06,0.06,0.05,0.02,0.04,{"$f":"+P343/O343*100*6.38","v":21.679611650485434},"",6]
[null,2,null,18,null,null,"Ziegenmilch (3,7 % Eiweiß)",null,null,null,null,null,null,null,12.7,0.57999999999999996,0.28000000000000003,0.12,0.22,0.18,0.03,0.06,29.137007874015747,"",6]
[null,2,null,18,null,null,"Schafmilch (5,3 % Eiweiß)",null,null,null,null,null,null,null,16.899999999999999,0.83,0.25,0.11,0.22,0.18,0.02,0.08,31.333727810650892,"",6]
[null,null,null,null,null,"Futtermittel nach Anlage 1, Tab.4  der StoffBilV"," +++Futtermittel nach Anlage 1, Tab.4  der StoffBilV+++",null,null,null,null,null,null,null,null,null,null,null,null,null,null,null,null,"","StoffBilV"]
[null,2,null,20,null,null,"Altbrot",2.4,0.3,0.13,0.6,0.5,0.12,null,65,{"$f":"+H347/100*$O347","v":1.56},{"$f":"+I347/100*$O347","v":0.19500000000000001},8.4499999999999992E-2,0.39,0.32500000000000001,7.8E-2,0,15,"","StoffBilV"]
[null,2,null,20,null,null,"Apfeltrester",1.33,0.4,0.18,0.84,0.7,0.33,null,22,{"$f":"+H348/100*$O348","v":0.29260000000000003},8.7999999999999995E-2,3.9599999999999996E-2,0.18479999999999999,0.15399999999999997,7.2599999999999998E-2,0,8.3125,"","StoffBilV"]
[null,2,null,20,null,null,"Bierhefe, flüssig",8.4,2.6,1.1400000000000001,1.77,1.47,0.3,null,10,0.84000000000000008,0.26,0.114,0.17699999999999999,0.14699999999999999,0.03,0,52.5,"","StoffBilV"]
[null,2,null,20,null,null,"Biertreber, siliert",4,1.3699999999999999,0.6,0.1,0.08,0.33,null,25,1,0.34249999999999997,0.15,2.5000000000000001E-2,0.02,8.2500000000000004E-2,0,25,"","StoffBilV"]
[null,2,null,20,null,null,"Fischmehl",10.08,7.56,3.3299999999999996,1.08,0.9,0.48,null,91,9.1728000000000005,6.8795999999999999,3.0302999999999995,0.98280000000000001,0.81900000000000006,0.43679999999999997,0,63,"","StoffBilV"]
[null,2,null,20,null,null,"Getreideschlempe, frisch (Weizen)",5.76,1.1499999999999999,0.5,0.96,0.8,0.4,null,60,3.456,0.69,0.3,0.57599999999999996,0.48,0.24,0,36,"","StoffBilV"]
[null,2,null,20,null,null,"Getreideschlempe, getrocknet (Weizen)",6.11,2.06,0.90999999999999992,1.61,1.34,0.6,null,92,5.6212,1.8952,0.83719999999999983,1.4812000000000001,1.2328000000000001,0.55200000000000005,0,38.1875,"","StoffBilV"]
[null,2,null,20,null,null,"Haferschälkleie",1.1199999999999999,0.39,0.16999999999999998,1.21,1,0.2,null,90,1.0079999999999998,0.35100000000000003,0.153,1.089,0.9,0.18,0,6.9999999999999991,"","StoffBilV"]
[null,2,null,20,null,null,"Kartoffeleiweiß",13.440000000000001,1.1499999999999999,0.5,0.9,0.74,0.08,null,90,12.096000000000002,1.0349999999999999,0.45,0.81,0.66600000000000004,7.2000000000000008E-2,0,84.000000000000014,"","StoffBilV"]
[null,2,null,20,null,null,"Kartoffelpülpe, siliert",0.78,0.64,0.27999999999999997,2.65,2.2000000000000002,0.12,null,18,0.1404,0.11520000000000001,5.0399999999999993E-2,0.47699999999999998,0.39600000000000002,2.1599999999999998E-2,0,4.875,"","StoffBilV"]
[null,2,null,20,null,null,"Kartoffelschlempe, frisch",5.2799999999999994,1.53,0.67999999999999994,6.63,5.5,0.08,null,5.5,0.29039999999999994,8.4150000000000003E-2,3.7399999999999996E-2,0.36464999999999997,0.30249999999999999,4.4000000000000003E-3,0,32.999999999999993,"","StoffBilV"]
[null,2,null,20,null,null,"Leinextraktionsschrot",6.01,2.2000000000000002,0.97,1.45,1.2,0.95,null,89,5.3489000000000004,1.9580000000000002,0.86330000000000007,1.2905,1.0680000000000001,0.84550000000000003,0,37.5625,"","StoffBilV"]
[null,2,null,20,null,null,"Leinkuchen",5.92,2.06,0.90999999999999992,1.45,1.2,0.88,null,90,5.3280000000000003,1.8540000000000001,0.81899999999999984,1.3049999999999999,1.08,0.79200000000000004,0,37,"","StoffBilV"]
[null,2,null,20,null,null,"Luzernegrünmehl",2.96,0.8,0.35,2.89,2.4,0.46,null,90,2.6640000000000001,0.72,0.31499999999999995,2.601,2.16,0.41399999999999998,0,18.5,"","StoffBilV"]
[null,2,null,20,null,null,"Magermilch, frisch",5.76,2.29,1.01,1.45,1.2,0.27,null,8.5,0.48959999999999998,0.19464999999999999,8.5849999999999996E-2,0.12325,0.10200000000000001,2.2950000000000002E-2,0,36,"","StoffBilV"]
[null,2,null,20,null,null,"Maiskeimextraktionsschrot",4,1.6,0.71,0.96,0.8,0.51,null,89,3.56,1.4239999999999999,0.63189999999999991,0.85439999999999994,0.71199999999999997,0.45390000000000003,0,25,"","StoffBilV"]
[null,2,null,20,null,null,"Maiskleberfutter",4,1.95,0.86,1.69,1.4,0.8,null,90,3.6,1.7549999999999999,0.77400000000000002,1.5209999999999999,1.2599999999999998,0.72,0,25,"","StoffBilV"]
[null,2,null,20,null,null,"Malzkeime",4.7200000000000006,1.83,0.80999999999999994,2.5299999999999998,2.1,0.25,null,92,4.3424000000000005,1.6836,0.74519999999999997,2.3275999999999999,1.9320000000000002,0.23,0,29.500000000000004,"","StoffBilV"]
[null,2,null,20,null,null,"Maniok",0.43,0.22999999999999998,0.1,0.96,0.8,0.18,null,88,0.37840000000000001,0.2024,8.7999999999999995E-2,0.84479999999999988,0.70399999999999996,0.15839999999999999,0,2.6875,"","StoffBilV"]
[null,2,null,20,null,null,"Melasseschnitzel",1.6,0.18,0.08,1.74,1.44,0.3,null,91,1.456,0.1638,7.2800000000000004E-2,1.5833999999999999,1.3104,0.27300000000000002,0,10,"","StoffBilV"]
[null,2,null,20,null,null,"Molke, Permeat",0.67,3.07,1.35,3.01,2.5,0.23,null,5,3.3500000000000002E-2,0.1535,6.7500000000000004E-2,0.15049999999999999,0.125,1.15E-2,0,4.1875,"","StoffBilV"]
[null,2,null,20,null,null,"Pressschnitzel, siliert",1.3599999999999999,0.22999999999999998,0.1,0.51,0.42,0.35,null,27,0.36719999999999997,6.2100000000000002E-2,2.7E-2,0.13770000000000002,0.11339999999999999,9.4499999999999987E-2,0,8.5,"","StoffBilV"]
[null,2,null,20,null,null,"Rapsextraktionsschrot",6.1,2.75,1.21,1.86,1.54,0.96,null,89,5.4290000000000003,2.4475000000000002,1.0769,1.6554000000000002,1.3706,0.85439999999999994,0,38.125,"","StoffBilV"]
[null,2,null,20,null,null,"Rapskuchen, fettarm",5.86,2.75,1.21,1.76,1.46,0.91,null,90,5.2740000000000009,2.4750000000000001,1.089,1.5840000000000001,1.3140000000000001,0.81900000000000006,0,36.625,"","StoffBilV"]
[null,2,null,20,null,null,"Roggengrießkleie",2.56,2.29,1.01,1.69,1.4,0.6,null,88,2.2528000000000001,2.0152000000000001,0.88879999999999992,1.4871999999999999,1.2319999999999998,0.52800000000000002,0,16,"","StoffBilV"]
[null,2,null,20,null,null,"Roggenkleie",2.59,2.54,1.1199999999999999,1.69,1.4,0.6,null,88,2.2791999999999999,2.2351999999999999,0.98559999999999981,1.4871999999999999,1.2319999999999998,0.52800000000000002,0,16.1875,"","StoffBilV"]
[null,2,null,20,null,null,"Rübenkleinteile",1.2,0.48,0.21000000000000002,1.39,1.1499999999999999,0.38,null,17,0.20400000000000001,8.1599999999999992E-2,3.5700000000000003E-2,0.23629999999999998,0.19550000000000001,6.4600000000000005E-2,0,7.5,"","StoffBilV"]
[null,2,null,20,null,null,"Sojaextraktionsschrot, geschält, 48 % RP",8.7200000000000006,1.72,0.76,2.77,2.2999999999999998,0.45,null,88,7.6736000000000004,1.5136000000000001,0.66879999999999995,2.4375999999999998,2.024,0.39600000000000002,0,54.500000000000007,"","StoffBilV"]
[null,2,null,20,null,null,"Sojaextraktionsschrot, ungeschält, 44 % RP",8,1.67,0.74,2.65,2.2000000000000002,0.5,null,88,7.04,1.4696,0.6512,2.3319999999999999,1.9360000000000002,0.44,0,50,"","StoffBilV"]
[null,2,null,20,null,null,"Sojaschalen",2.16,0.37,0.16,1.73,1.43,0.5,null,88,1.9008,0.3256,0.14080000000000001,1.5224,1.2584,0.44,0,13.5,"","StoffBilV"]
[null,2,null,20,null,null,"Sonnenblumenextraktionsschrot, teilgeschält",6.08,2.52,1.1099999999999999,1.57,1.3,0.86,null,89,5.4112,2.2427999999999999,0.98789999999999989,1.3973000000000002,1.157,0.76539999999999997,0,38,"","StoffBilV"]
[null,2,null,20,null,null,"Sauermolke, frisch",1.58,2.75,1.21,3.01,2.5,0.24,null,6.4,0.10112000000000002,0.17600000000000002,7.7440000000000009E-2,0.19264000000000001,0.16000000000000003,1.5359999999999999E-2,0,9.875,"","StoffBilV"]
[null,2,null,20,null,null,"Süßmolke, frisch",2.16,1.53,0.67999999999999994,3.01,2.5,0.24,null,6,0.12959999999999999,9.1800000000000007E-2,4.0799999999999996E-2,0.18059999999999998,0.15000000000000002,1.44E-2,0,13.5,"","StoffBilV"]
[null,2,null,20,null,null,"Trockenschnitzel",1.33,0.22999999999999998,0.1,0.54,0.45,0.3,null,90,1.1970000000000001,0.20699999999999999,0.09,0.48600000000000004,0.40500000000000003,0.27,0,8.3125,"","StoffBilV"]
[null,2,null,20,null,null,"Weizengrießkleie",2.82,2.41,1.06,1.45,1.2,0.71,null,87.5,2.4674999999999998,2.1087500000000001,0.92749999999999999,1.2687499999999998,1.05,0.62124999999999997,0,16.073999999999998,"","StoffBilV"]
[null,2,null,20,null,null,"Weizenkleie",2.56,2.98,1.31,1.45,1.2,0.88,null,88,2.2528000000000001,2.6223999999999998,1.1528,1.2759999999999998,1.056,0.77440000000000009,0,14.592000000000001,"","StoffBilV"]
[null,2,null,20,null,null,"Weizennachmehl",3.04,1.6,0.71,1.08,0.9,0.48,null,87,2.6448,1.3920000000000001,0.61769999999999992,0.9396000000000001,0.78300000000000014,0.41759999999999997,0,17.327999999999999,"","StoffBilV"]
[null,2,null,20,null,null,"Zuckerrübenmelasse",2.16,0.11000000000000001,0.05,6.51,5.4,0.03,null,78,1.6848000000000001,8.5800000000000001E-2,3.9E-2,5.077799999999999,4.2120000000000006,2.3399999999999997E-2,0,13.5,{"$f":"+IF(B384=1,\"ja\",\"\")","v":""},"StoffBilV"]
[null,null,null,null,null,"sonstige Futtermittel"," +++sonstige Futtermittel+++",null,null,null,null,null,null,null,null,null,null,null,null,null,null,null,null,"","FutMitGrub"]
[null,2,null,20,null,null,"Alleinfutter I Legehennen",3.1817600000000001,1.431875,0.625,1.095345,0.90900000000000003,0.28186,null,88,2.7999488000000001,1.2600500000000001,0.55000000000000004,0.96390360000000008,0.79991999999999996,0.2480368,null,19.885999999999999,"","FutMitGrub",8455]
[null,2,null,20,null,null,"Alleinfutter Jungsau",2.9091200000000002,1.170701,0.51100000000000001,0.89049499999999993,0.73899999999999999,0.37636599999999998,null,88,2.5600256000000003,1.03021688,0.44968000000000002,0.78363559999999999,0.65032000000000001,0.33120208000000001,null,18.182000000000002,"","FutMitGrub",8264]
[null,2,null,20,null,null,"Alleinfutter Legehennen, N/P reduziert",3.0908800000000003,1.170701,0.51100000000000001,1.095345,0.90900000000000003,0.28186,null,88,2.7199744000000003,1.03021688,0.44968000000000002,0.96390360000000008,0.79991999999999996,0.2480368,null,19.318000000000001,"","FutMitGrub",8454]
[null,2,null,20,null,null,"Alleinfutter Schwein, Anfangsmast",3.1817600000000001,1.431875,0.625,1.0266600000000001,0.85199999999999998,0.37636599999999998,null,88,2.7999488000000001,1.2600500000000001,0.55000000000000004,0.90346080000000006,0.74975999999999998,0.33120208000000001,null,19.885999999999999,"","FutMitGrub",8233]
[null,2,null,20,null,null,"Alleinfutter Schwein, Endmast",2.7271999999999998,1.170701,0.51100000000000001,0.89049499999999993,0.73899999999999999,0.37636599999999998,null,88,2.3999359999999998,1.03021688,0.44968000000000002,0.78363559999999999,0.65032000000000001,0.33120208000000001,null,17.044999999999998,"","FutMitGrub",8234]
[null,2,null,20,null,null,"Alleinfutter Schwein, Mast",3.0908800000000003,1.431875,0.625,1.1640300000000001,0.96599999999999997,0.37636599999999998,null,88,2.7199744000000003,1.2600500000000001,0.55000000000000004,1.0243464000000002,0.85007999999999995,0.33120208000000001,null,19.318000000000001,"","FutMitGrub",8235]
[null,2,null,20,null,null,"Alleinfutter Zuchtsau, tragend",{"$f":"P392/$O$392*100","v":2.1818181818181817},1.0934318181818181,0.47727272727272729,0.95852272727272725,0.79545454545454541,0.56818181818181823,null,88,1.92,0.96222000000000008,0.42000000000000004,0.84350000000000003,0.7,0.5,0.1,13.636363636363635,"","FutMitGrub",8314]
[null,2,null,20,null,null,"Alleinfutter Zuchtsau, säugend",{"$f":"P393/$O$393*100","v":3.0000000000000004},1.3017045454545455,0.56818181818181823,1.2323863636363637,1.0227272727272727,0.56818181818181823,null,88,2.64,1.1455,0.5,1.0845,0.9,0.5,0.1,19,"","FutMitGrub"]
[null,2,null,20,null,null,"Backabfälle",1.9272000000000002,0.59565999999999997,0.26,1.2050000000000001,1,0.43107999999999996,null,88,1.6959360000000001,0.5241808,0.22880000000000003,1.0604,0.88000000000000012,0.37935039999999998,null,12.045000000000002,"","FutMitGrub",6185]
[null,2,null,20,null,null,"Buttermilch",5.984,1.9748419999999995,0.86199999999999988,2.169,1.8,0.18569600000000003,null,8,0.47872000000000003,0.15798735999999997,6.8959999999999994E-2,0.17352000000000001,0.14399999999999999,1.4855680000000001E-2,null,37.4,"","FutMitGrub",7715]
[null,2,null,20,null,null,"Ca-Propionat",0,0,0,0,0,0,null,99,0,0,0,0,0,0,null,0,"","FutMitGrub",5936]
[null,2,null,20,null,null,"DL-Methionin",15.88768,0,0,0,0,0,null,99.7,15.84001696,0,0,0,0,0,null,99.298000000000002,"","FutMitGrub",6925]
[null,2,null,20,null,null,"Eiweißreicher Ergänzer Legehennen",5.4545600000000007,3.124924,1.3640000000000001,1.6436200000000003,1.3640000000000001,0.28186,null,88,4.8000128000000002,2.7499331200000001,1.2003200000000001,1.4463856000000004,1.2003200000000001,0.2480368,null,34.091000000000008,"","FutMitGrub",8475]
[null,2,null,20,null,null,"Ergänz.futter Aufzuchtferkel, (Anteil 30 %)",6.3636800000000004,2.602576,1.1359999999999999,1.3688800000000001,1.1359999999999999,0.56537800000000005,null,88,5.6000384000000007,2.2902668799999999,0.99968000000000001,1.2046144000000001,0.99968000000000001,0.49753264000000003,null,39.773000000000003,"","FutMitGrub",8216]
[null,2,null,20,null,null,"Ergänz.futter Fohlen",2.9454400000000001,1.5807899999999999,0.69000000000000006,1.6616949999999999,1.379,0.47584600000000005,null,88,2.5919872000000002,1.3910952000000001,0.60719999999999996,1.4622915999999999,1.2135199999999999,0.41874448000000009,null,18.408999999999999,"","FutMitGrub",8615]
[null,2,null,20,null,null,"Ergänz.futter I Schwein, Mast, (Anteil 30 %)",6.3636800000000004,1.562462,0.68200000000000005,1.779785,1.4769999999999999,0.66651599999999989,null,88,5.6000384000000007,1.3749665600000001,0.60016000000000003,1.5662107999999999,1.29976,0.58653407999999996,null,39.773000000000003,"","FutMitGrub",8245]
[null,2,null,20,null,null,"Ergänz.futter II Schwein, Mast, 28 % RP",5.0908800000000003,3.644981,1.591,1.6677199999999999,1.3839999999999999,0.56537800000000005,null,88,4.4799743999999997,3.2075832800000001,1.40008,1.4675936000000001,1.2179199999999999,0.49753264000000003,null,31.818000000000001,"","FutMitGrub",8254]
[null,2,null,20,null,null,"Ergänz.futter Jungsau, (Anteil 30 %)",6.3636800000000004,2.082519,0.90900000000000003,1.3688800000000001,1.1359999999999999,0.66651599999999989,null,88,5.6000384000000007,1.8326167200000001,0.79991999999999996,1.2046144000000001,0.99968000000000001,0.58653407999999996,null,39.773000000000003,"","FutMitGrub",8265]
[null,2,null,20,null,null,"Ergänz.futter Mastlämmer",3.3091200000000001,1.5807899999999999,0.69000000000000006,1.3845450000000001,1.149,0.28186,null,88,2.9120256000000002,1.3910952000000001,0.60719999999999996,1.2183996000000001,1.01112,0.2480368,null,20.682000000000002,"","FutMitGrub",8525]
[null,2,null,20,null,null,"Ergänz.futter Pferde",2.5817600000000001,1.3173249999999999,0.57499999999999996,1.6616949999999999,1.379,0.47584600000000005,null,88,2.2719488000000001,1.159246,0.50600000000000001,1.4622915999999999,1.2135199999999999,0.41874448000000009,null,16.135999999999999,"","FutMitGrub",8645]
[null,2,null,20,null,null,"Ergänz.futter Saugferkel, (Anteil 100 %)",3.4545599999999999,1.431875,0.625,1.0266600000000001,0.85199999999999998,0.37636599999999998,null,88,3.0400128,1.2600500000000001,0.55000000000000004,0.90346080000000006,0.74975999999999998,0.33120208000000001,null,21.590999999999998,"","FutMitGrub",8215]
[null,2,null,20,null,null,"Ergänz.futter Schwein, Mast, (Anteil 20 %)",8.1817600000000006,1.8213449999999998,0.79500000000000004,2.0545250000000004,1.7050000000000001,0.66651599999999989,null,88,7.1999487999999996,1.6027835999999998,0.6996,1.8079820000000002,1.5004000000000002,0.58653407999999996,null,51.136000000000003,"","FutMitGrub",8255]
[null,2,null,20,null,null,"Ergänz.futter Schwein, Mast (30 %)",{"$f":"P408/$O$408*100","v":6.3636363636363633},1.5620454545454543,0.68181818181818177,1.7801136363636365,1.4772727272727273,0.75439000000000001,null,88,5.6,1.3745999999999998,0.6,1.5665000000000002,1.3,0.66386319999999999,null,39.772727272727273,"","FutMitGrub",8266]
[null,2,null,20,null,null,"Ergänz.futter Zuchtpferde",2.9454400000000001,1.3173249999999999,0.57499999999999996,1.6616949999999999,1.379,0.47584600000000005,null,88,2.5919872000000002,1.159246,0.50600000000000001,1.4622915999999999,1.2135199999999999,0.41874448000000009,null,18.408999999999999,"","FutMitGrub",8665]
[null,2,null,20,null,null,"Ergänz.futter Zuchtsau, säugend (Anteil 30 %)",6.3636800000000004,2.082519,0.90900000000000003,2.0545250000000004,1.7050000000000001,0.66651599999999989,null,88,5.6000384000000007,1.8326167200000001,0.79991999999999996,1.8079820000000002,1.5004000000000002,0.58653407999999996,null,39.773000000000003,"","FutMitGrub",8345]
[null,2,null,20,null,null,"Ergänz.futter Zuchtsau, tragend (Anteil 25 %)",4.5454400000000001,2.602576,1.1359999999999999,2.0545250000000004,1.7050000000000001,0.66651599999999989,null,88,3.9999872000000005,2.2902668799999999,0.99968000000000001,1.8079820000000002,1.5004000000000002,0.58653407999999996,null,28.409000000000002,"","FutMitGrub",8355]
[null,2,null,20,null,null,"Ergänz.futter Zuchtschafe",2.9454400000000001,1.3173249999999999,0.57499999999999996,1.3845450000000001,1.149,0.28186,null,88,2.5919872000000002,1.159246,0.50600000000000001,1.2183996000000001,1.01112,0.2480368,null,18.408999999999999,"","FutMitGrub",8545]
[null,2,null,20,null,null,"Fasermix, 20 % Rohfaser",1.6,0.762903,0.33300000000000002,1.2050000000000001,1,0.51563799999999993,null,90,1.44,0.68661270000000008,0.29970000000000002,1.0845,0.9,0.46407419999999994,null,10,"","FutMitGrub",4674]
[null,2,null,20,null,null,"Fasermix, 30 % Rohfaser",1.4222399999999999,1.2737959999999999,0.55599999999999994,1.2050000000000001,1,0.47916199999999998,null,90,1.280016,1.1464164000000001,0.50039999999999996,1.0845,0.9,0.43124580000000001,null,8.8889999999999993,"","FutMitGrub",4675]
[null,2,null,20,null,null,"Ferkelaufzuchtfutter I",3.2728000000000002,1.431875,0.625,1.0266600000000001,0.85199999999999998,0.37636599999999998,null,88,2.880064,1.2600500000000001,0.55000000000000004,0.90346080000000006,0.74975999999999998,0.33120208000000001,null,20.455000000000002,"","FutMitGrub",8224]
[null,2,null,20,null,null,"Ferkelaufzuchtfutter II",3.1817600000000001,1.170701,0.51100000000000001,0.89049499999999993,0.73899999999999999,0.37636599999999998,null,88,2.7999488000000001,1.03021688,0.44968000000000002,0.78363559999999999,0.65032000000000001,0.33120208000000001,null,19.885999999999999,"","FutMitGrub",8225]
[null,2,null,20,null,null,"Futtersäure",0,0,0,0,0,0,null,99,0,0,0,0,0,0,null,0,"","FutMitGrub",5955]
[null,2,null,20,null,null,"Futterharnstoff",46.642400000000002,0,0,0,0,0,null,99,46.175976000000006,0,0,0,0,0,null,291.51499999999999,"","FutMitGrub",6985]
[null,2,null,20,null,null,"Futterzucker",1.6160000000000001E-2,0,0,0,0,0,null,99,1.5998399999999999E-2,0,0,0,0,0,null,0.10100000000000001,"","FutMitGrub",4535]
[null,2,null,20,null,null,"Kälberaufzuchtfutter, 18 % RP",3.2728000000000002,1.301288,0.56799999999999995,1.2327150000000002,1.0230000000000001,0.33988999999999991,null,88,2.880064,1.1451334399999999,0.49984000000000001,1.0847892000000001,0.90023999999999993,0.2991031999999999,null,20.455000000000002,"","FutMitGrub",8035]
[null,2,null,20,null,null,"Karottentrester",1.39,0.55000000000000004,0.24,2.7951807228915664,2.3199999999999998,1.82,null,17,0.23629999999999998,9.3500000000000014E-2,4.0799999999999996E-2,0.47518072289156627,0.39439999999999997,0.30940000000000001,null,8.6875,"","FutMitGrub"]
[null,2,null,20,null,null,"Kartoffelflocken",1.4182400000000002,0.59565999999999997,0.26,2.8920000000000003,2.4,0.1658,null,88,1.2480512000000001,0.5241808,0.22880000000000003,2.5449600000000001,2.1120000000000001,0.14590399999999998,null,8.8640000000000008,"","FutMitGrub",4615]
[null,2,null,20,null,null,"Kartoffelschälabfälle, gedämpft",1.6800000000000002,0.57274999999999998,0.25,2.6510000000000002,2.2000000000000002,0.23211999999999997,null,11,0.18480000000000002,6.3002500000000003E-2,2.7500000000000004E-2,0.29161000000000004,0.24199999999999999,2.5533199999999995E-2,null,10.500000000000002,"","FutMitGrub",7605]
[null,2,null,20,null,null,"Kartoffelstärke",5.4560000000000011E-2,0.13745999999999997,0.06,0.12050000000000001,0.1,1.6580000000000001E-2,null,88,4.8012800000000008E-2,0.12096479999999998,5.28E-2,0.10604,8.7999999999999995E-2,1.45904E-2,null,0.34100000000000008,"","FutMitGrub",4625]
[null,2,null,20,null,null,"Kohlensaurer Kalk",0,9.1639999999999999E-2,0.04,0,0,0.26528000000000002,null,99.7,0,9.1365080000000001E-2,3.9880000000000006E-2,0,0,0.26448415999999997,null,0,"","FutMitGrub",4925]
[null,2,null,20,null,null,"Kükenaufzuchtfutter",3.2728000000000002,1.8213449999999998,0.79500000000000004,1.6436200000000003,1.3640000000000001,0.28186,null,88,2.880064,1.6027835999999998,0.6996,1.4463856000000004,1.2003200000000001,0.2480368,null,20.455000000000002,"","FutMitGrub",8415]
[null,2,null,20,null,null,"Lab-/Süßmolke",2.1920000000000002,1.9633870000000002,0.85699999999999998,3.0125000000000002,2.5,0.23709399999999997,null,5,0.1096,9.8169350000000016E-2,4.2850000000000006E-2,0.15062500000000001,0.125,1.1854699999999999E-2,null,13.700000000000001,"","FutMitGrub",7735]
[null,2,null,20,null,null,"Legemehlergänzer Legehennen",3.6728000000000001,1.844255,0.80500000000000005,1.6616949999999999,1.379,0.28186,null,88,3.2320640000000003,1.6229444000000002,0.70840000000000003,1.4622915999999999,1.2135199999999999,0.2480368,null,22.955000000000002,"","FutMitGrub",8465]
[null,2,null,20,null,null,"Futteröl",0,0,0,0,0,0,null,99.9,0,0,0,0,0,0,null,0,"","FutMitGrub",5405]
[null,2,null,20,null,null,"Lignozellulose",0.24352000000000001,4.582E-2,0.02,1.4411800000000001,1.1960000000000002,0.86547599999999991,null,92,0.22403840000000003,4.2154400000000002E-2,1.8400000000000003E-2,1.3258856000000001,1.1003200000000002,0.79623792000000004,null,1.522,"","FutMitGrub",4685]
[null,2,null,20,null,null,"L-Lysin-HCl",12.67008,0,0,0,0,0,null,98.5,12.480028799999999,0,0,0,0,0,null,79.188000000000002,"","FutMitGrub",6905]
[null,2,null,20,null,null,"L-Threonin",15.838399999999998,0,0,0,0,0,null,99,15.680015999999998,0,0,0,0,0,null,98.99,"","FutMitGrub",6935]
[null,2,null,20,null,null,"Magermilch",5.7759999999999998,2.4971900000000002,1.0900000000000001,1.4460000000000002,1.2,0.26528000000000002,null,8.6,0.49673599999999996,0.21475833999999999,9.3740000000000004E-2,0.12435599999999999,0.1032,2.2814079999999997E-2,null,36.1,"","FutMitGrub",7725]
[null,2,null,20,null,null,"Magermilchpulver",5.83216,2.4742800000000003,1.08,1.6870000000000001,1.4,0.26528000000000002,null,94.1,5.4880625599999995,2.3282974800000003,1.0162800000000001,1.587467,1.3173999999999999,0.24962847999999999,null,36.451000000000001,"","FutMitGrub",6725]
[null,2,null,20,null,null,"Maiskornsilage",1.6,0.8,0.35,0.48192771084337355,0.4,0.22,null,65,1.04,0.52,0.22749999999999998,0.31325301204819278,0.26,0.14300000000000002,null,10,"","FutMitGrub"]
[null,2,null,20,null,null,"Maisschlempe, trocken",5.76,1.2142299999999999,0.53,0.96400000000000008,0.8,0.39791999999999994,null,90,5.1840000000000002,1.0928070000000001,0.47699999999999998,0.86760000000000004,0.72,0.35812799999999995,null,36,"","FutMitGrub",6204]
[null,2,null,20,null,null,"Mastkükenfutter",4,1.6930489999999998,0.73899999999999999,1.095345,0.90900000000000003,0.28186,null,88,3.5200000000000005,1.4898831199999998,0.65032000000000001,0.96390360000000008,0.79991999999999996,0.2480368,null,25,"","FutMitGrub",8445]
[null,2,null,20,null,null,"Mastkükenfutter, N/P reduziert",3.8182400000000003,1.431875,0.625,1.095345,0.90900000000000003,0.28186,null,88,3.3600512,1.2600500000000001,0.55000000000000004,0.96390360000000008,0.79991999999999996,0.2480368,null,23.864000000000001,"","FutMitGrub",8444]
[null,2,null,20,null,null,"Milchaustauscher (MAT) Mast, 20 % Rohfett",3.7446399999999995,1.4616579999999999,0.63800000000000001,2.41,2,0.33160000000000001,null,94,3.5199615999999994,1.37395852,0.59971999999999992,2.2654000000000001,1.8799999999999997,0.31170399999999998,null,23.403999999999996,"","FutMitGrub",8025]
[null,2,null,20,null,null,"Milchleist.futter, 14 % RP, EnergieStufe 3",2.54,1.042405,0.45499999999999996,1.2327150000000002,1.0230000000000001,0.28186,null,88,2.2399871999999998,0.91731640000000003,0.40039999999999998,1.0847892000000001,0.90023999999999993,0.2480368,null,15.875,"","FutMitGrub",8105]
[null,2,null,20,null,null,"Milchleist.futter, 16 % RP, EnergieStufe 3",2.9091200000000002,1.042405,0.45499999999999996,1.2327150000000002,1.0230000000000001,0.28186,null,88,2.5600256000000003,0.91731640000000003,0.40039999999999998,1.0847892000000001,0.90023999999999993,0.2480368,null,18.182000000000002,"","FutMitGrub",8115]
[null,2,null,20,null,null,"Milchleist.futter, 18 % RP, EnergieStufe 4",3.2728000000000002,1.042405,0.45499999999999996,1.33,1.1000000000000001,0.38,null,88,2.880064,0.91731640000000003,0.40039999999999998,1.1704000000000001,0.96800000000000008,0.33439999999999998,null,20.455000000000002,"","FutMitGrub",8125]
[null,2,null,20,null,null,"Milchleist.futter, 25 % RP, EnergieStufe 3",4.5454400000000001,1.562462,0.68200000000000005,1.2327150000000002,1.0230000000000001,0.33988999999999991,null,88,3.9999872000000001,1.3749665600000001,0.60016000000000003,1.0847892000000001,0.90024000000000015,0.2991031999999999,null,28.409000000000002,"","FutMitGrub",8135]
[null,2,null,20,null,null,"Milchleist.futter, 32 % RP, EnergieStufe 3",5.8182400000000003,1.83,0.8,1.23,1.02,0.33988999999999991,null,88,5.1200512000000007,1.6104000000000003,0.70400000000000007,1.0824,0.89760000000000006,0.2991031999999999,null,36.364000000000004,"","FutMitGrub",8145]
[null,2,null,20,null,null,"Milchleist.futter, 38 % RP, EnergieStufe 3",6.91,2.082519,0.90900000000000003,2.19069,1.8180000000000001,0.65988400000000003,null,88,6.0808,1.8326167200000001,0.79992000000000008,1.9278071999999999,1.5998400000000002,0.58069791999999998,null,43.1875,"","FutMitGrub",8147]
[null,2,null,20,null,null,"Mineralfutter Ferkel 4 AS (4 %)",{"$f":"P446/$O$444*100","v":3.7272727272727271},{"$f":"Q446/$O446*100","v":6.0315789473684216},{"$f":"R446/$O$446*100","v":2.6315789473684208},{"$f":"S446/$O$446*100","v":0},{"$f":"T446/$O$446*100","v":0},{"$f":"U446/$O$446*100","v":1.7473684210526315},null,95,3.28,5.73,2.5,0,0,1.66,0.7,21.578947368421055,"","FutMitGrub",8286]
[null,2,null,20,null,null,"Mineralfutter Geflügel",1.3473599999999999,16.880088000000001,7.3680000000000003,0,0,2.0940539999999999,null,95,1.2799919999999998,16.036083600000001,6.9996000000000009,0,0,1.9893512999999998,null,8.4209999999999994,"","FutMitGrub",8485]
[null,2,null,20,null,null,"Mineralfutter Pferde",0,12.057533000000001,5.2629999999999999,0,0,5.2359639999999992,null,95,0,11.45465635,4.9998500000000003,0,0,4.9741657999999989,null,0,"","FutMitGrub",8685]
[null,2,null,20,null,null,"Mineralfutter Rind, Milchkuh,   12 % Ca, 0 % P",0,0,0,0,0,5.24,null,95,0,0,0,0,0,4.97,null,0,"","FutMitGrub"]
[null,2,null,20,null,null,"Mineralfutter Rind, Milchkuh, 12 % Ca,  8 % P",0,19.292510999999998,8.4209999999999994,0,0,5.2359639999999992,null,95,0,18.32788545,7.9999499999999983,0,0,4.9741657999999989,null,0,"","FutMitGrub",8185]
[null,2,null,20,null,null,"Mineralfutter Rind, Milchkuh, 20 % Ca,  5 % P",0,12.057533000000001,5.2629999999999999,0,0,3.4900899999999999,null,95,0,11.45465635,4.9998500000000003,0,0,3.3155854999999996,null,0,"","FutMitGrub",8186]
[null,2,null,20,null,null,"Mineralfutter Rind, Milchkuh, 22 % Ca,  2 % P",0,4.8225549999999995,2.105,0,0,3.4900899999999999,null,95,0,4.5814272499999991,1.9997499999999999,0,0,3.3155854999999996,null,0,"","FutMitGrub",8187]
[null,2,null,20,null,null,"Mineralfutter Schafe",0,14.469956,6.3159999999999998,0,0,5.2359639999999992,null,95,0,13.746458199999998,6.0001999999999995,0,0,4.9741657999999989,null,0,"","FutMitGrub",8585]
[null,2,null,20,null,null,"Mineralfutter Schwein, Anfangsmast",{"$f":"P454/$O454*100","v":3.4526315789473685},2.411578947368421,1.0526315789473684,0,0,1.7473684210526315,null,95,3.28,2.2909999999999999,1,0,0,1.66,0.5,21.578947368421055,"","FutMitGrub"]
[null,2,null,20,null,null,"Mineralfutter Schwein, Endmast",2.8631578947368426,0,0,0,0,1.7473684210526315,null,95,2.72,0,0,0,0,1.66,0.4,17.894736842105267,"","FutMitGrub",8297]
[null,2,null,20,null,null,"Mineralfutter Zuchtsau, säugend (3,0 %)",2.1894736842105265,7.2347368421052618,3.1578947368421053,0,0,1.7473684210526315,null,95,2.08,6.8729999999999993,3,0,0,1.66,0.5,13.684210526315791,"","FutMitGrub",8385]
[null,2,null,20,null,null,"Mineralfutter Zuchtsau, tragend (2,5 %)",1.6,2.411578947368421,1.0526315789473684,0,0,{"$f":"U457/$O457*100","v":1.7473684210526315},null,95,1.52,2.2909999999999999,1,0,0,1.66,0.2,10,{"$f":"+IF(B457=1,\"ja\",\"\")","v":""},"FutMitGrub",8386]
[null,2,null,20,null,null,"Mineralfutter, Rindermast 22 % Ca, 2 % P",0,4.59,2,0,0,3.49,null,95,0,4.3605,1.9,0,0,3.3155000000000001,null,0,"","FutMitGrub"]
[null,2,null,20,null,null,"Mineralfutter, Rindermast 22 % Ca, 0 % P",0,0,0,0,0,3.4900899999999999,null,95,0,0,0,0,0,3.3155854999999996,null,0,"","FutMitGrub"]
[null,2,null,20,null,null,"Futterfett",0,0,0,0,0,0,null,99.9,0,0,0,0,0,0,null,0,"","FutMitGrub",5825]
[null,2,null,20,null,null,"Molkenpulver (Labmolke)",2.1166399999999999,1.9633870000000002,0.85699999999999998,3.0125000000000002,2.5,0.23709399999999997,null,96,2.0319744000000002,1.8848515200000002,0.82272000000000001,2.8919999999999999,2.4,0.22761023999999996,null,13.228999999999999,"","FutMitGrub",6735]
[null,2,null,20,null,null,"Monokalziumphosphat",0,55.213099999999997,24.1,0,0,0,null,95,0,52.452444999999997,22.895,0,0,0,null,0,"","FutMitGrub",4915]
[null,2,null,20,null,null,"Natriumbikarbonat",0,0,0,0,0,0,null,99,0,0,0,0,0,0,null,0,"","FutMitGrub",4965]
[null,2,null,20,null,null,"Propionsäure",0,0,0,0,0,0,null,99,0,0,0,0,0,0,null,0,"","FutMitGrub",5935]
[null,2,null,20,null,null,"Propylenglykol",0,0,0,0,0,0,null,99,0,0,0,0,0,0,null,0,"","FutMitGrub",5975]
[null,2,null,20,null,null,"Glyzerin (roh, rein)",0,0,0,0,0,0,null,99,0,0,0,0,0,0,null,0,"","FutMitGrub",5964]
[null,2,null,20,null,null,"Rindermastfutter, 40 % RP, EnergieStufe 3",7.27,2.082519,0.90900000000000003,2.19069,1.8180000000000001,0.65988400000000003,null,88,{"$f":"H467*$O$467/100","v":6.3975999999999997},1.8326167200000001,0.79992000000000008,1.9278071999999999,1.5998400000000002,0.58069791999999998,null,45,"","FutMitGrub",8045]
[null,2,null,20,null,null,"Sauermilcherzeugnisse (Joghurt,Quark)",6.4,1.7640699999999998,0.77,1.0483499999999999,0.86999999999999988,0.11605999999999998,null,16,1.024,0.28225119999999998,0.1232,0.167736,0.13919999999999999,1.8569599999999999E-2,null,40,"","FutMitGrub",5715]
[null,2,null,20,null,null,"Sauermolke",2.496,3.68851,1.61,3.0125000000000002,2.5,0.23211999999999997,null,5.6000000000000005,0.13977600000000001,0.20655656000000003,9.0160000000000004E-2,0.16870000000000002,0.14000000000000001,1.299872E-2,null,15.6,"","FutMitGrub",7745]
[null,2,null,20,null,null,"Sojakuchen, 8 % Rohfett",7.1910399999999992,1.6036999999999999,0.7,2.41,2,0.49740000000000001,null,89,6.4000255999999993,1.4272929999999999,0.623,2.1449000000000003,1.78,0.44268600000000002,null,44.943999999999996,"","FutMitGrub",6439]
[null,2,null,20,null,null,"Tryptophan",15.838399999999998,0,0,0,0,0,null,99,15.680015999999998,0,0,0,0,0,null,98.99,"","FutMitGrub",6945]
[null,2,null,20,null,null,"Viehsalz",0,0,0,0,0,0,null,99,0,0,0,0,0,0,null,0,"","FutMitGrub",4945]
[null,2,null,20,null,null,"Vollmilchergänzer",0,0,0,0,0,0,null,95,0,0,0,0,0,0,null,0,"","FutMitGrub"]
[null,2,null,20,null,null,"Vitaminkonzentrat",0,0,0,0,0,0,null,95,0,0,0,0,0,0,null,0,"","FutMitGrub",8395]

{"sheet":"Futtermittel alt","index":4,"n_rows":165,"n_cols":7,"rows_kept":165,"cut":false,"hidden":true,"merged":[]}
[]
[]
[]
[]
[]
[]
["Ackerbohne",30,4.0999999999999996,1.2,1.4,0.2,86]
["Alleinfutter Jungsau",16.000160000000001,2.5600256000000003,1.03021688,0.78363559999999999,0.33120208000000001,88]
["Alleinfutter Schwein, AnfangsMast",17.499680000000001,2.7999488000000001,1.2600500000000001,0.90346080000000006,0.33120208000000001,88]
["Alleinfutter Schwein, EndMast",14.999599999999999,2.3999359999999998,1.03021688,0.78363559999999999,0.33120208000000001,88]
["AlleinFutter Schwein, Mast",16.999839999999999,2.7199744000000003,1.2600500000000001,1.0243464000000002,0.33120208000000001,88]
["Alleinfutter ZuchtSau",16.000160000000001,2.5600256000000003,1.2741625600000002,0.97556799999999999,0.50336880000000006,88]
["Alleinfutter ZuchtSau, säugend",16.5,2.6399999999999997,1.1451334399999999,1.0847892000000001,0.49753264000000003,88]
["Alleinfutter ZuchtSau, tragend",11.99968,1.9199488000000002,0.96167015999999994,0.84301800000000005,0.41874448000000009,88]
["Altbrot",7.995000000000001,1.2791999999999999,0.36633090000000001,0.391625,7.5438999999999992E-2,65]
["Backabfälle",10.599600000000001,1.6959360000000001,0.5241808,1.0604,0.37935039999999998,88]
["Bierhefe, abgepreßt",13.125,2.1,0.65293500000000004,0.4428375,7.4609999999999996E-2,25]
["Bierhefe, frisch",5.25,0.84000000000000008,0.26117400000000002,0.17713499999999999,2.9843999999999999E-2,10]
["BierHefe, trocken",46.899900000000002,7.503984,2.3505659999999997,1.5942149999999999,0.268596,90]
["Biertreber, frisch",6.0719999999999992,0.97152000000000016,0.32990399999999998,2.3136E-2,7.9583999999999988E-2,24]
["Biertreber, siliert",6.1503000000000005,0.98404800000000014,0.3395262,2.38108E-2,8.1905199999999997E-2,24.7]
["BierTreber, trocken",23.799600000000002,3.8079360000000002,1.2371399999999999,8.6760000000000004E-2,0.29843999999999998,90]
["Buttermilch",2.992,0.47872000000000003,0.15798735999999997,0.17352000000000001,1.4855680000000001E-2,8]
["Ca-Formiat",0,0,0,0,0,99]
["Ca-Propionat",0,0,0,0,0,99]
["CCM (60 % TS)",10.5,1.01,0.41,0.36,0.1,60]
["Diät-Mineralfutter Ferkel",14.699700000000002,2.3519520000000003,2.1711806999999999,0,1.5712866000000001,90]
["Dikalziumphosphat",0,0,40.283913049999995,0,0,95]
["DL-Methionin",99.000106000000017,15.84001696,0,0,0,99.7]
["EiweißKonzentrat Schwein, Mast, 50% Rohprotein",45.500399999999999,7.2800640000000003,3.4757219199999994,2.4378596000000003,0.58653407999999996,88]
["Eiweißkonzentrat ZuchtSau, 46% Rohprotein",46.500079999999997,7.4400127999999999,4.1712695200000001,1.5906000000000002,0.58653407999999996,88]
["Eiweißkonzentrat ZuchtSau, 50% Rohprotein",50.6,8.0960000000000001,4.6349679199999994,2.4378596000000003,0.58653407999999996,88]
["Eiweißkonzentrat ZuchtSau, 54% Rohprotein",54.599600000000017,8.7359360000000006,5.5623647199999997,1.5906000000000002,0.58653407999999996,88]
["Erbse",26,3.6,1.1000000000000001,1.4,0.2,86]
["ErdnußExtraktionsSchrot, 5% Rohfaser",49.999839999999992,7.999974400000001,1.3507735999999999,1.3785200000000002,0.53984480000000001,88]
["ErgänzungsFutter Aufzuchtferkel, (Anteil 30%)",35.000240000000005,5.6000384000000007,2.2902668799999999,1.2046144000000001,0.49753264000000003,88]
["ErgänzungsFutter I Schwein, Mast, (Anteil 30%)",35.000240000000005,5.6000384000000007,1.3749665600000001,1.5662107999999999,0.58653407999999996,88]
["ErgänzungsFutter II Schwein, Mast, 28% Rohprotein",27.999839999999999,4.4799743999999997,3.2075832800000001,1.4675936000000001,0.49753264000000003,88]
["Ergänzungsfutter Jungsau, (Anteil 30%)",35.000240000000005,5.6000384000000007,1.8326167200000001,1.2046144000000001,0.58653407999999996,88]
["ErgänzungsFutter Saugferkel, (Anteil 100%)",19.000080000000001,3.0400128,1.2600500000000001,0.90346080000000006,0.33120208000000001,88]
["ErgänzungsFutter Schwein, Mast, (Anteil 20%)",44.999680000000005,7.1999487999999996,1.6027835999999998,1.8079820000000002,0.58653407999999996,88]
["ErgänzungsFutter Schwein, Mast, 40% Rohprotein",40.000399999999999,6.4000640000000004,1.3749665600000001,1.9882500000000001,0.66386319999999999,88]
["ErgänzungsFutter ZuchtSau, säugend (Anteil 30%)",35.000240000000005,5.6000384000000007,1.8326167200000001,1.8079820000000002,0.58653407999999996,88]
["ErgänzungsFutter ZuchtSau, tragend (Anteil 25%)",24.999919999999996,3.9999872000000005,2.2902668799999999,1.8079820000000002,0.58653407999999996,88]
["Fasermix, 20% Rohfaser",9,1.44,0.68661270000000008,1.0845,0.46407419999999994,90]
["Fasermix, 30% Rohfaser",8.0000999999999998,1.280016,1.1464164000000001,1.0845,0.43124580000000001,90]
["FerkelaufzuchtFutter I",18.000400000000003,2.880064,1.2600500000000001,0.90346080000000006,0.33120208000000001,88]
["FerkelaufzuchtFutter II",17.499680000000001,2.7999488000000001,1.03021688,0.78363559999999999,0.33120208000000001,88]
["Fischmehl, 55-60% Rohprotein",58.09984,9.2959744000000004,7.5034832000000007,0.99774000000000007,0.44235439999999998,92]
["Fischmehl, 60-65% Rohprotein",60.800399999999996,9.7280639999999998,5.8145579999999999,0.86760000000000004,0.37304999999999999,90]
["Fischmehl, 65-70% Rohprotein",65.600080000000005,10.496012800000001,5.6706832,0.81912285000000007,0.28666819999999998,91]
["Fischpreßsaft, getrocknet, 72% Rohprotein",75.300160000000005,12.048025600000003,3.2248116000000002,3.880100000000001,0.36608639999999998,92]
["FlüssigFutter Ferkel",4.5737800000000011,0.73180480000000014,0.41890934999999996,0.28352445000000004,8.6564180000000004E-2,23]
["FlüssigFutter Schwein, Mast, Molke",4.4431400000000005,0.71090240000000005,0.35936625999999999,0.37803260000000011,8.6564180000000004E-2,23]
["FlüssigFutter Schwein, Mast, Wasser",4.4431400000000005,0.71090240000000005,0.35989319000000003,0.28324730000000004,8.6182839999999997E-2,23]
["Fumarsäure",0,0,0,0,0,99]
["Futterharnstoff",288.59985000000006,46.175976000000006,0,0,0,99]
["Gerstenstroh (90 % TS)",null,5,3,17,1,90]
["Hafer",11,1.51,0.8,0.6,0.2,86]
["HaferFlocken",11.699869999999999,1.8719792000000002,0.92774045000000016,0.46274409999999999,0.22028188000000001,91]
["HaferfutterMehl",13.800438000000002,2.2080700799999997,1.1870358300000001,0.87627600000000005,0.30142440000000004,90.9]
["HaferschälKleie",6.8000120000000015,1.0880019200000002,0.35363876,1.0941400000000001,0.18065567999999999,90.8]
["Haferstroh (90 % TS)",null,5,3,17,2,90]
["Kartoffel",null,0.35,0.14000000000000001,0.6,0.04,22]
["Kartoffel, gedämpft, 15% Stärke",2.1560000000000001,0.34495999999999999,0.12600500000000001,0.58322000000000007,5.1066399999999991E-2,22]
["Kartoffel, gedämpft, siliert, 16% Stärke",2.3759999999999999,0.38016,0.100804,0.58322000000000007,5.1066399999999991E-2,22]
["Kartoffeleiweiß",76.399959999999993,12.2239936,1.0841012000000001,0.81583320000000015,7.5439000000000006E-2,91]
["KartoffelFlocken",7.800320000000001,1.2480512000000001,0.5241808,2.5449600000000001,0.14590399999999998,88]
["Kartoffelpresspülpe, siliert",0.88200000000000001,0.14112,0.1113426,0.47717999999999999,2.0890799999999994E-2,18]
["KartoffelPülpe, getrocknet",6.1001599999999998,0.97602559999999983,0.50402000000000002,2.3328800000000003,0.10213279999999998,88]
["Kartoffelschälabfälle, gedämpft",1.6632,0.26611200000000002,6.1856999999999995E-2,0.28630800000000001,8.9531999999999997E-3,10.8]
["Kartoffelschlempe, frisch",1.8419999999999999,0.29471999999999998,0.1003458,0.39765,4.9739999999999993E-3,6]
["KartoffelSchrot, -Schnitzel",8.1004000000000005,1.2960639999999999,0.5241808,2.5449600000000001,0.14590399999999998,88]
["KartoffelStärke",0.30008000000000007,4.8012800000000008E-2,0.12096479999999998,0.10604,1.45904E-2,88]
["KokosExtraktionsSchrot",20.9,3.3439999999999999,1.2902912,2.4389200000000004,0.55443520000000002,88]
["Körnermais ",10,1.38,0.8,0.5,0.2,86]
["Labmolke",0.68500000000000005,0.1096,9.8169350000000016E-2,0.15062500000000001,1.1854699999999999E-2,5]
["Labmolke, eingedickt",1.6439999999999997,0.26304000000000005,0.23560644000000003,0.36149999999999999,2.8451279999999995E-2,12]
["LeinExtraktionsSchrot",33.900240000000004,5.4240383999999997,1.9152759999999998,1.2724800000000001,0.83165279999999997,88]
["Lignozellulose",1.4002400000000002,0.22403840000000003,4.2154400000000002E-2,1.3258856000000001,0.79623792000000004,92]
["LKS (50 % TS)",null,0.76,0.32,0.36,0.1,50]
["LKS gesiebt, 9% RFas",4.75,0.76,0.40092499999999998,0.24702499999999999,0.10362499999999999,50]
["L-Lysin-HCl",78.00018,12.480028799999999,0,0,0,98.5]
["L-Threonin",98.000100000000003,15.680015999999998,0,0,0,99]
["Lupine blau",33,4.4800000000000004,1.02,0.99,0.2,86]
["Magermilch",3.1045999999999996,0.49673599999999996,0.21475833999999999,0.12435599999999999,2.2814079999999997E-2,8.6]
["MagermilchPulver",34.300390999999998,5.4880625599999995,2.3282974800000003,1.587467,0.24962847999999999,94.1]
["Maiscobs (89 % TS)",null,1.22,0.51,1.45,0.27,89]
["MaisfutterMehl",10.399840000000001,1.6639744000000003,1.00804,0.21207999999999999,0.43771200000000005,88]
["MaisKeimExtraktionsSchrot",11.600159999999999,1.8560255999999999,1.5120600000000002,0.84831999999999996,0.45230240000000005,88]
["MaisKleberfutter, 23-30% Rohprotein",22.699599999999997,3.6319359999999996,1.9152759999999998,1.4845600000000001,0.70033919999999994,88]
["MaisKleberfutter, bis 23% Rohprotein",19.399599999999996,3.103936,1.9152759999999998,1.4845600000000001,0.70033919999999994,88]
["MaisKornSilage Schrot",6.5,1.04,0.52120250000000001,0.32113249999999999,0.13471249999999999,65]
["MaisSchlempe, flüssig",2.0090000000000003,0.32144000000000006,0.13791819999999999,7.6168050000000015E-2,5.4548200000000005E-2,7.0000000000000009]
["MaisSchlempe, trocken",32.4,5.1840000000000002,1.0928070000000001,0.86760000000000004,0.35812799999999995,90]
["MalzKeime",27.199800000000003,4.3519679999999994,1.7072531999999998,2.3280599999999998,0.22880400000000001,92]
["ManiokMehl, -Schnitzel",2.3003199999999997,0.36805120000000002,0.22176880000000004,0.84831999999999996,0.16049440000000001,88]
["Melasse (Zuckerrübe)",10.53,1.6848000000000003,9.1135979999999991E-2,5.0754600000000014,2.58648E-2,78]
["MelasseSchnitzel, 12% Zucker",8.19,1.3104,0.16678480000000001,1.3158600000000003,0.2715804,91]
["MelasseSchnitzel, 18% Zucker",8.6912000000000003,1.3905920000000001,0.15806067200000001,1.5547392,0.26740224000000001,89.600000000000009]
["MelasseSchnitzel, 22% Zucker",9.9770000000000003,1.5963200000000002,0.16623495999999999,1.6394025000000003,0.27068508000000002,90.7]
["MilchzuckerMelasse",6.75,1.0799999999999998,1.2371399999999999,1.4460000000000002,9.9479999999999985E-2,30]
["MilchzuckerMelasse, proteinarm",2.4074999999999998,0.38520000000000004,1.6289010000000002,1.3556250000000001,7.4609999999999996E-2,22.5]
["Mineralfutter Ferkel",11.499749999999999,1.83996,4.5814272499999991,0,1.9893512999999998,95]
["Mineralfutter Ferkel, 3 Aminosäuren",11.499749999999999,1.83996,6.8732290999999988,0,3.3155854999999996,95]
["Mineralfutter Ferkel, 4 Aminosäuren (4%)",20.52,3.2831999999999999,5.7240634999999997,0,1.6538549999999996,95]
["Mineralfutter Schwein, AnfangsMast (3,0%)",15.959999999999999,2.5535999999999999,2.2852724999999996,0,1.6538549999999996,95]
["Mineralfutter Schwein, EndMast (2,5%)",11.969999999999999,1.9151999999999998,2.2852724999999996,0,1.6538549999999996,95]
["Mineralfutter Schwein, Mast",5.4995500000000002,0.87992799999999993,4.5814272499999991,0,1.9893512999999998,95]
["Mineralfutter Schwein, Mast, Molke (2,5%)",7.9799999999999995,1.2767999999999999,0,0,1.6538549999999996,95]
["Mineralfutter ZuchtSau, säugend (3,0%)",13.015000000000002,2.0824000000000003,6.8775819999999994,0,1.6538549999999996,95]
["Mineralfutter ZuchtSau, tragend (2,5%)",9.5,1.52,2.2852724999999996,0,1.6538549999999996,95]
["Molke, entzuckert",22.8004,3.6480640000000002,3.3587892799999999,5.5063680000000002,0.50509311999999995,95.199999999999989]
["MolkenPulver (Labmolke)",12.699839999999998,2.0319744000000002,1.8848515200000002,2.8919999999999999,0.22761023999999996,96]
["Monokalziumphosphat",0,0,52.452444999999997,0,0,95]
["NaßSchnitzel",1.4351,0.22961600000000004,2.6186130000000002E-2,0.10727753500000001,9.4754699999999997E-2,12.7]
["Natriumbikarbonat",0,0,0,0,0,99]
["ObstTrester ApfelTrester",1.452,0.23232,5.0402000000000002E-2,0.18557000000000001,7.2951999999999989E-2,22]
["PalmkernExtraktionsSchrot",16.5,2.6399999999999997,1.4515776,0.84831999999999996,0.56902560000000002,88]
["Permeatmolke",0.21000000000000002,3.3600000000000005E-2,0.15349700000000002,0.15062500000000001,1.1606E-2,5]
["Preßschnitzel siliert",2.3520000000000003,0.37632000000000004,5.3884320000000006E-2,0.14170800000000003,9.7490400000000005E-2,28.000000000000004]
["Propionsäure",0,0,0,0,0,99]
["Propylenglykol",0,0,0,0,0,99]
["RapsExtraktionsSchrot",35.299800000000005,5.6479680000000005,2.7959364,1.6744679999999998,0.86249160000000002,90]
["RapsKuchen, 8% Rohfett",33.700029999999998,5.3920048000000005,2.65813275,1.6031561000000001,0.82832021999999994,91]
["Reinglyzerin",0,0,0,0,0,99]
["ReisfutterMehl",13.00024,2.0800383999999998,2.9636375999999993,1.1664400000000001,1.0359183999999999,88]
["RoggenKleie",14.299999999999999,2.2879999999999998,2.2781704,1.4845600000000001,0.52525440000000001,88]
["RoggennachMehl",13.6004,2.1760640000000002,1.0483616,0.84831999999999996,0.29180799999999996,88]
["RoggenSchlempe, trocken",32.4,5.1840000000000002,1.0928070000000001,0.86760000000000004,0.35812799999999995,90]
["Roggenstroh (90 % TS)",null,5,3,20,2,90]
["Rohglyzerin",0,0,0,0,0,88]
["Rübenkleinteile",1.2750000000000001,0.20400000000000001,8.0620289999999997E-2,0.23557750000000005,6.4827800000000005E-2,17]
["Sauermolke",0.87360000000000004,0.13977600000000001,0.20655656000000003,0.16870000000000002,1.299872E-2,5.6000000000000005]
["Sauermolke, eingedickt",1.8720000000000001,0.29952000000000001,0.44262119999999994,0.36149999999999999,2.7854399999999994E-2,12]
["Silomais (32 % TS)",null,0.43,0.18,0.51,0.1,32]
["Sojabohnen",32,4.4000000000000004,1.5,1.7,0.5,86]
["Sojabohnen, getoastet",37.4,5.984,1.5208803499999999,2.2420832499999999,0.57358510000000007,93.5]
["SojaExtraktionsSchrot, 40% Rohprotein",40.000399999999999,6.4000640000000004,1.4918992000000002,2.6510000000000002,0.53984480000000001,88]
["SojaExtraktionsSchrot, 42% Rohprotein",41.999759999999995,6.7199615999999995,1.4918992000000002,2.6510000000000002,0.53984480000000001,88]
["SojaExtraktionsSchrot, 44% Rohprotein",44,7.0400000000000009,1.4112559999999998,2.3328800000000003,0.43771200000000005,88]
["SojaExtraktionsSchrot, 48% Rohprotein",47.999600000000001,7.6799360000000005,1.5322207999999999,2.4389200000000004,0.39394080000000004,88]
["Sojaschalen",11.499840000000001,1.8399744000000002,0.29031551999999994,1.5195532,0.43771200000000005,88]
["Sommerfuttergerste",12,1.65,0.8,0.6,0.2,86]
["SonnenblumenExtraktionsSchrot, 11% Rohfaser",40.200160000000004,6.4320256000000002,1.9959192000000001,1.3785200000000002,0.78788160000000007,88]
["SonnenblumenExtraktionsSchrot, 20% Rohfaser",33.699599999999997,5.3919359999999994,2.1572055999999997,1.3785200000000002,0.75870079999999995,88]
["SonnenblumenKuchen",21.899680000000004,3.5039488000000008,1.9011634399999999,1.3785200000000002,0.78788160000000007,88]
["TorulaHefe",45.800112000000006,7.3280179200000006,4.6494470400000001,1.7467680000000001,0.30042960000000002,90.600000000000009]
["Triticale",12,1.65,0.8,0.6,0.2,86]
["TrockenSchnitzel",7.5198,1.2031680000000002,0.15567344999999999,0.49127850000000006,0.27038664000000001,90.600000000000009]
["Tryptophan",98.000100000000003,15.680015999999998,0,0,0,99]
["Viehsalz",0,0,0,0,0,99]
["VitaminKonzentrat",0,0,0,0,0,95]
["Wasser",0,0,0,0,0,0.01]
["WeizenFlocken",12.1,1.9359999999999999,0.76611039999999997,0.5302,0.18967519999999999,88]
["WeizenKeime",25.999600000000001,4.1599360000000001,1.9959192000000001,1.0604,0.40853119999999993,88]
["WeizenKleie",16.000160000000001,2.5600256000000003,2.6209039999999999,1.2724800000000001,0.77329119999999996,88]
["WeizennachMehl",16.000160000000001,2.5600256000000003,1.4918992000000002,0.9543600000000001,0.42312159999999999,88]
["Weizenschlempe, flüssig",2.1599999999999997,0.34560000000000002,7.2853799999999996E-2,5.7840000000000003E-2,2.3875199999999996E-2,6]
["WeizenSchlempe, trocken",34.399799999999999,5.5039680000000013,2.2268520000000001,1.4532300000000002,0.537192,90]
["Weizenstroh (90 % TS)",null,5,3,14,2,90]
["Wintergerste mehrzeilig",12,1.65,0.8,0.6,0.2,86]
["Winterroggen",11,1.51,0.8,0.6,0.1,86]
["Winterweizen A/B-Sorte",14,2.11,0.8,0.55000000000000004,0.2,86]
["Zuckerrübenschnitzel",7.2996040000000013,1.16793664,0.20985559999999998,1.3245360000000002,0.24299648000000001,91.600000000000009]

{"sheet":"Hauptfrüchte","index":5,"n_rows":86,"n_cols":8,"rows_kept":86,"cut":false,"hidden":true,"merged":[]}
["Hauptfrüchte"]
[null,null,"Rp","N","P2O5","TS","Rp %","Rp %"]
[null,null,"in TM","FM","FM","%","FM","TM berechnet"]
[]
[null," +++Getreide+++ "]
[null,"Winterweizen C-Sorte",12,1.81,0.8,86,{"$f":"+D6*5.7","v":10.317},{"$f":"+G6/F6*100","v":11.996511627906976}]
[null,"Winterweizen A/B-Sorte",14,2.11,0.8,86,{"$f":"+D7*5.7","v":12.026999999999999},{"$f":"+G7/F7*100","v":13.984883720930233}]
[null,"Winterweizen E-Sorte",16,2.41,0.8,86,13.737000000000002,15.973255813953491]
[null,"Winterbrauweizen",12,1.81,0.75,86,10.317,11.996511627906976]
[null,"Sommerweizen",14,2.11,0.75,86,12.026999999999999,13.984883720930233]
[null,"Weizenstroh",{"$f":"+H11","v":3.6337209302325584},0.5,0.3,86,{"$f":"+D11*6.25","v":3.125},3.6337209302325584]
[null,"Wintergerste ",12,1.65,0.8,86,10.3125,11.991279069767442]
[null,"Winterbraugerste",11,1.51,0.8,86,9.4375,10.973837209302326]
[null,"Sommerfuttergerste",12,1.65,0.8,86,10.3125,11.991279069767442]
[null,"Sommerbraugerste",10,1.38,0.8,86,8.625,10.029069767441861]
[null,"Gerstenstroh",{"$f":"+H16","v":3.6337209302325584},0.5,0.3,86,3.125,3.6337209302325584]
[null,"Winterroggen",11,1.51,0.8,86,9.4375,10.973837209302326]
[null,"Sommerroggen",11,1.51,0.8,86,9.4375,10.973837209302326]
[null,"Roggenstroh",{"$f":"+H19","v":3.6337209302325584},0.5,0.3,86,3.125,3.6337209302325584]
[null,"Hafer",11,1.51,0.8,86,9.4375,10.973837209302326]
[null,"Haferstroh",{"$f":"+H21","v":3.6337209302325584},0.5,0.3,86,3.125,3.6337209302325584]
[null,"Triticale",12,1.65,0.8,86,10.3125,11.991279069767442]
[null,"Dinkel",12,1.65,0.8,86,10.3125,11.991279069767442]
[null,"Emmer/Einkorn",12,1.81,0.75,86,11.3125,13.154069767441861]
[null,"Hartweizen (Durum)",12,1.81,0.8,86,11.3125,13.154069767441861]
[null,"Buchweizen",16.933139534883722,2.33,0.65,86,14.5625,16.933139534883722]
[null," ++++Körnermais, sonstige Körnernutzung+++ ",null,null,null,null," "]
[null,"Körnermais ",10,1.38,0.8,86,8.625,10.029069767441861]
[null,"Körnermaisstroh",{"$f":"+H29","v":6.5406976744186052},0.9,0.2,86,5.625,6.5406976744186052]
[null,"Hirse",17.005813953488371,2.34,0.89,86,14.625,17.005813953488371]
[null,"Amarant",17.005813953488371,2.34,0.89,86,14.625,17.005813953488371]
[null,"Quinoa",16.279069767441865,2.2400000000000002,0.94,86,14.000000000000002,16.279069767441861]
[null," +++Körnerleguminosen+++",null,null,null,null," "]
[null,"Ackerbohnen",29.8,4.0999999999999996,1.2,86,25.624999999999996,29.796511627906973]
[null,"Erbsen",26,3.6,1.1000000000000001,86,22.5,26.162790697674421]
[null,"Wicken",26,3.6,1.1000000000000001,86,22.5,26.162790697674421]
[null,"Lupinen blau",33,4.4800000000000004,1.02,86,28.000000000000004,32.558139534883722]
[null,"Linsen",26,3.5775999999999999,1.1000000000000001,86,22.36,26]
[null,"Sojabohnen",32,4.4000000000000004,1.5,86,27.500000000000004,31.976744186046517]
[null," +++Ölfrüchte und Faserpflanzen+++",null,null,null,null," "]
[null,"Raps",23,3.35,1.8,91,20.9375,23.008241758241756]
[null,"Rübsen",23,3.35,1.8,91,20.9375,23.008241758241756]
[null,"Sonnenblumen ",20,2.91,1.6,91,18.1875,19.986263736263737]
[null,"Körnersenf",35,5.08,1.77,91,31.75,34.890109890109891]
[null,"Öllein, Faserflachs ",24,3.5,1.2,91,21.875,24.03846153846154]
[null,"Leindotter",24,3.5,1.2,91,21.875,24.03846153846154]
[null,"Flachs (Faserlein)",{"$f":"+H47","v":7.2674418604651168},1,0.64,86,6.25,7.2674418604651168]
[null,"Hanf",{"$f":"+H48","v":6.25},0.4,0.3,40,2.5,6.25]
[null," +++Hackfrüchte+++",null,null,null,null," "]
[null,"Kartoffel ",{"$f":"+H50","v":9.9431818181818183},0.35,0.14000000000000001,22,2.1875,9.9431818181818183]
[null,"Zuckerrüben",{"$f":"+H51","v":4.8913043478260869},0.18,0.1,23,1.125,4.8913043478260869]
[null,"Zuckerrübenblatt",{"$f":"+H52","v":13.888888888888889},0.4,0.11,18,2.5,13.888888888888889]
[null,"Futter-, Runkelrüben",{"$f":"+H53","v":7.5},0.18,0.09,15,1.125,7.5]
[null,"Kohl-, Steckrüben",{"$f":"+H54","v":7.291666666666667},0.14000000000000001,7.0000000000000007E-2,12,0.87500000000000011,7.291666666666667]
[null," +++Mehrschnittiger Feldfutterbau+++ ",null,null,null,null," "]
[null,"Esparsette",20.3,0.65,0.14000000000000001,20,4.0625,20.3125]
[null,"Ackergras 3-4 Schnitte/Jahr ",16.2,0.52,0.16,20,3.25,16.25]
[null,"Ackergras 5 Schnitte/Jahr",16.600000000000001,0.53,0.16,20,3.3125,16.5625]
[null,"Kleegras (Kleeanteil 30 %)",17.600000000000001,0.56000000000000005,0.15,20,3.5000000000000004,17.5]
[null,"Kleegras (Kleeanteil 50 %)",18.2,0.57999999999999996,0.14000000000000001,20,3.6249999999999996,18.124999999999996]
[null,"Kleegras (Kleeanteil 70 %)",19.2,0.61,0.14000000000000001,20,3.8125,19.0625]
[null,"Luzernegras (Luz.anteil 30 %)",17.600000000000001,0.56000000000000005,0.15,20,3.5000000000000004,17.5]
[null,"Luzernegras (Luz.anteil 50 %)",18.2,0.57999999999999996,0.15,20,3.6249999999999996,18.124999999999996]
[null,"Luzernegras (Luz.anteil 70 %)",19.2,0.61,0.14000000000000001,20,3.8125,19.0625]
[null,"Rotklee",20.46,0.65,0.13,20,4.0625,20.3125]
[null,"Luzerne",20.46,0.65,0.14000000000000001,20,4.0625,20.3125]
[null," +++Grünland+++"]
[null,"1 Schnittnutzung",8.6,1.3759999999999999,0.5,100,{"$f":"+D68*6.25","v":8.6},{"$f":"+G68/F68*100","v":8.6}]
[null,"2 Schnittnutzungen",11.4,1.8240000000000001,0.65,100,11.4,11.4]
[null,"3 Schnittnutzungen",15,2.4,0.71,100,15,15]
[null,"4 Schnittnutzungen",17,2.72,0.81,100,17,17]
[null,"5 Schnittnutzungen",17.5,2.8,0.87,100,17.5,17.5]
[null,"6 Schnittnutzungen",18.2,2.9119999999999999,0.89,100,18.2,18.2]
[null," +++Futterpflanzen+++",null,null,null,null," "]
[null,"Silomais (28 % TM)",{"$f":"+H75","v":8.4821428571428577},0.38,0.16,28,2.375,8.4821428571428577]
[null,"Silomais (32 % TM)",{"$f":"+H76","v":8.3984375},0.43,0.17,32,2.6875,8.3984375]
[null,"Silomais (35 % TM)",{"$f":"+H77","v":8.3984375},0.47031249999999997,0.18,35,2.939453125,8.3984375]
[null,"CCM",10.5,1.0080000000000002,0.40799999999999997,60,{"$f":"+D78*6.25","v":6.3000000000000016},{"$f":"+G78/F78*100","v":10.500000000000002}]
[null,"Lieschkolbensilage",{"$f":"+H79","v":9.5},0.76,0.32,50,4.75,9.5]
[null,"GPS Getreide",10,0.56000000000000005,0.23099999999999996,35,3.5000000000000004,10.000000000000002]
[null,"GPS Lupinen",{"$f":"+H81","v":10.000000000000002},0.56000000000000005,0.23,35,3.5000000000000004,10.000000000000002]
[null,"GPS Erbsen/Ackerbohne",{"$f":"+H82","v":10.000000000000002},0.56000000000000005,0.23,35,3.5000000000000004,10.000000000000002]
[null,"GPS Sonnenblumen",8.4,0.46900000000000003,0.19599999999999998,35,2.9312500000000004,8.375]
[null,"GPS Rübsen ",{"$f":"+H84","v":10.000000000000002},0.56000000000000005,0.23,35,3.5000000000000004,10.000000000000002]
[null,"GPS Wicken",{"$f":"+H85","v":10.000000000000002},0.56000000000000005,0.23,35,3.5000000000000004,10.000000000000002]
[null,"GPS Raps ",{"$f":"+H86","v":10.000000000000002},0.56000000000000005,0.23,35,3.5000000000000004,10.000000000000002]

{"sheet":"Jahr","index":6,"n_rows":10,"n_cols":4,"rows_kept":10,"cut":false,"hidden":true,"merged":[]}
[]
[]
["2016/17"]
[2017]
["2017/18"]
[2018]
["2018/19"]
[2019]
["2019/20",null,null," "]
[2020]

{"sheet":"Tabelle1","index":7,"n_rows":0,"n_cols":0,"rows_kept":0,"cut":false,"hidden":true,"merged":[]}